BDBM50325078 1-((1-benzyl-1H-tetrazol-5-yl)(4-(trifluoromethoxy)phenyl)methyl)-4-cyclobutyl-1,4-diazepane::CHEMBL1223447
SMILES: FC(F)(F)Oc1ccc(cc1)C(N1CCCN(CC1)C1CCC1)c1nnnn1Cc1ccccc1
InChI Key: InChIKey=BUTHKUNDVNBKIW-UHFFFAOYSA-N
Data: 1 IC50
Activity Spreadsheet -- Enzyme Inhibition Constant Data from BindingDB
Found 1 hit for monomerid = 50325078
Trg + Lig
Ki
nM
ΔG°
kcal/mole
IC50
nM
Kd
nM
EC50/IC50
nM
koff
s-1
kon
M-1s-1
pHTemp
°C
Histamine H3 receptor
(Homo sapiens (Human))
BDBM50325078
(1-((1-benzyl-1H-tetrazol-5-yl)(4-(trifluoromethoxy...)
Show SMILES FC(F)(F)Oc1ccc(cc1)C(N1CCCN(CC1)C1CCC1)c1nnnn1Cc1ccccc1
Show InChI InChI=1S/C25H29F3N6O/c26-25(27,28)35-22-12-10-20(11-13-22)23(33-15-5-14-32(16-17-33)21-8-4-9-21)24-29-30-31-34(24)18-19-6-2-1-3-7-19/h1-3,6-7,10-13,21,23H,4-5,8-9,14-18H2
Reactome pathway
n/an/a 51n/an/an/an/an/an/a
Evotec (UK) Ltd
Curated by ChEMBL
Assay Description
Antagonist activity at human histamine H3 receptor
Bioorg Med Chem Lett 20: 5165-9 (2010)
Article DOI: 10.1016/j.bmcl.2010.07.009
BindingDB Entry DOI: 10.7270/Q2TQ61RV