BDBM50325091 3-(4-((1-benzyl-1H-tetrazol-5-yl)(4-cyclobutyl-1,4-diazepan-1-yl)methyl)phenyl)-4-methyl-1,2,5-oxadiazole::CHEMBL1222500
SMILES: Cc1nonc1-c1ccc(cc1)C(N1CCCN(CC1)C1CCC1)c1nnnn1Cc1ccccc1
InChI Key: InChIKey=JJYWXVYGBJSRKA-UHFFFAOYSA-N
Data: 1 IC50
Activity Spreadsheet -- Enzyme Inhibition Constant Data from BindingDB
Found 1 hit for monomerid = 50325091
Trg + Lig
Ki
nM
ΔG°
kcal/mole
IC50
nM
Kd
nM
EC50/IC50
nM
koff
s-1
kon
M-1s-1
pHTemp
°C
Histamine H3 receptor
(Homo sapiens (Human))
BDBM50325091
(3-(4-((1-benzyl-1H-tetrazol-5-yl)(4-cyclobutyl-1,4...)
Show SMILES Cc1nonc1-c1ccc(cc1)C(N1CCCN(CC1)C1CCC1)c1nnnn1Cc1ccccc1
Show InChI InChI=1S/C27H32N8O/c1-20-25(30-36-29-20)22-11-13-23(14-12-22)26(34-16-6-15-33(17-18-34)24-9-5-10-24)27-28-31-32-35(27)19-21-7-3-2-4-8-21/h2-4,7-8,11-14,24,26H,5-6,9-10,15-19H2,1H3
Reactome pathway
n/an/a 9.20n/an/an/an/an/an/a
Evotec (UK) Ltd
Curated by ChEMBL
Assay Description
Antagonist activity at human histamine H3 receptor
Bioorg Med Chem Lett 20: 5165-9 (2010)
Article DOI: 10.1016/j.bmcl.2010.07.009
BindingDB Entry DOI: 10.7270/Q2TQ61RV