BDBM50325096 1-((1-benzyl-1H-tetrazol-5-yl)(4-(pyridin-2-yloxy)phenyl)methyl)-4-cyclobutyl-1,4-diazepane::CHEMBL1222595
SMILES: C(c1ccccc1)n1nnnc1C(N1CCCN(CC1)C1CCC1)c1ccc(Oc2ccccn2)cc1
InChI Key: InChIKey=TWZYVGSVLWFPII-UHFFFAOYSA-N
Data: 1 IC50
Activity Spreadsheet -- Enzyme Inhibition Constant Data from BindingDB
Found 1 hit for monomerid = 50325096
Trg + Lig
Ki
nM
ΔG°
kcal/mole
IC50
nM
Kd
nM
EC50/IC50
nM
koff
s-1
kon
M-1s-1
pHTemp
°C
Histamine H3 receptor
(Homo sapiens (Human))
BDBM50325096
(1-((1-benzyl-1H-tetrazol-5-yl)(4-(pyridin-2-yloxy)...)
Show SMILES C(c1ccccc1)n1nnnc1C(N1CCCN(CC1)C1CCC1)c1ccc(Oc2ccccn2)cc1
Show InChI InChI=1S/C29H33N7O/c1-2-8-23(9-3-1)22-36-29(31-32-33-36)28(35-19-7-18-34(20-21-35)25-10-6-11-25)24-13-15-26(16-14-24)37-27-12-4-5-17-30-27/h1-5,8-9,12-17,25,28H,6-7,10-11,18-22H2
Reactome pathway
n/an/a 0.900n/an/an/an/an/an/a
Evotec (UK) Ltd
Curated by ChEMBL
Assay Description
Antagonist activity at human histamine H3 receptor
Bioorg Med Chem Lett 20: 5165-9 (2010)
Article DOI: 10.1016/j.bmcl.2010.07.009
BindingDB Entry DOI: 10.7270/Q2TQ61RV