BDBM50325232 2-(4-((1H-1,2,4-Triazol-1-yl)methyl)-5-(4-bromophenyl)-1-(2,4-dichlorophenyl)-1H-pyrazol-3-yl)-5-(1-phenylcyclopropyl)-1,3,4-thiadiazole::CHEMBL1223102
SMILES: Clc1ccc(c(Cl)c1)-n1nc(c(Cn2cncn2)c1-c1ccc(Br)cc1)-c1nnc(s1)C1(CC1)c1ccccc1
InChI Key: InChIKey=UZTSDXDUJZKDEU-UHFFFAOYSA-N
Data: 1 IC50
Activity Spreadsheet -- Enzyme Inhibition Constant Data from BindingDB
Found 1 hit for monomerid = 50325232
Trg + Lig
Ki
nM
ΔG°
kcal/mole
IC50
nM
Kd
nM
EC50/IC50
nM
koff
s-1
kon
M-1s-1
pHTemp
°C
Cannabinoid receptor 1
(Rattus norvegicus (rat))
BDBM50325232
(2-(4-((1H-1,2,4-Triazol-1-yl)methyl)-5-(4-bromophe...)
Show SMILES Clc1ccc(c(Cl)c1)-n1nc(c(Cn2cncn2)c1-c1ccc(Br)cc1)-c1nnc(s1)C1(CC1)c1ccccc1
Show InChI InChI=1S/C29H20BrCl2N7S/c30-20-8-6-18(7-9-20)26-22(15-38-17-33-16-34-38)25(37-39(26)24-11-10-21(31)14-23(24)32)27-35-36-28(40-27)29(12-13-29)19-4-2-1-3-5-19/h1-11,14,16-17H,12-13,15H2
Reactome pathway
n/an/a 2.23n/an/an/an/an/an/a
Green Cross Corporation
Curated by ChEMBL
Assay Description
Displacement of [3H]CP-55940 from CB1 receptor in Sprague-Dawley rat cerebellum after 1 hr by liquid scintillation counting
Bioorg Med Chem 18: 6377-88 (2010)
Article DOI: 10.1016/j.bmc.2010.07.013
BindingDB Entry DOI: 10.7270/Q2XG9RBT