BDBM50325333 (S)-N-(3-(5-(3-hydroxy-3-methyl-1-(methylamino)-1-oxobutan-2-ylcarbamoyl)furan-2-yl)benzyl)-2-(trifluoromethyl)pyrimidine-4-carboxamide::CHEMBL1223563
SMILES: CNC(=O)[C@@H](NC(=O)c1ccc(o1)-c1cccc(CNC(=O)c2ccnc(n2)C(F)(F)F)c1)C(C)(C)O
InChI Key: InChIKey=KXNXODOVFJBDPH-GOSISDBHSA-N
Data: 1 IC50
Activity Spreadsheet -- Enzyme Inhibition Constant Data from BindingDB
Found 1 hit for monomerid = 50325333
Trg + Lig
Ki
nM
ΔG°
kcal/mole
IC50
nM
Kd
nM
EC50/IC50
nM
koff
s-1
kon
M-1s-1
pHTemp
°C
Collagenase 3
(Homo sapiens (Human))
BDBM50325333
((S)-N-(3-(5-(3-hydroxy-3-methyl-1-(methylamino)-1-...)
Show SMILES CNC(=O)[C@@H](NC(=O)c1ccc(o1)-c1cccc(CNC(=O)c2ccnc(n2)C(F)(F)F)c1)C(C)(C)O |r|
Show InChI InChI=1S/C24H24F3N5O5/c1-23(2,36)18(21(35)28-3)32-20(34)17-8-7-16(37-17)14-6-4-5-13(11-14)12-30-19(33)15-9-10-29-22(31-15)24(25,26)27/h4-11,18,36H,12H2,1-3H3,(H,28,35)(H,30,33)(H,32,34)/t18-/m1/s1
NCI pathway
Reactome pathway
n/an/a 5n/an/an/an/an/an/a
Boehringer Ingelheim Pharmaceuticals
Curated by ChEMBL
Assay Description
Inhibition of MMP13
Bioorg Med Chem Lett 20: 5039-43 (2010)
Article DOI: 10.1016/j.bmcl.2010.07.036
BindingDB Entry DOI: 10.7270/Q28S4Q3K