BDBM50325467 1-(3-ethoxypropyl)-3-(1-(1-(pyridin-4-ylmethyl)piperidine-4-carbonyl)piperidin-4-yl)-1H-benzo[d]imidazol-2(3H)-one::CHEMBL1222799
SMILES: CCOCCCn1c2ccccc2n(C2CCN(CC2)C(=O)C2CCN(Cc3ccncc3)CC2)c1=O
InChI Key: InChIKey=ICHWSWUZDRHGDT-UHFFFAOYSA-N
Data: 1 KI  2 IC50  1 Kd
Activity Spreadsheet -- Enzyme Inhibition Constant Data from BindingDB
Found 4 hits for monomerid = 50325467
Trg + Lig
Ki
nM
ΔG°
kcal/mole
IC50
nM
Kd
nM
EC50/IC50
nM
koff
s-1
kon
M-1s-1
pHTemp
°C
HRH3
(GUINEA PIG)
BDBM50325467
(1-(3-ethoxypropyl)-3-(1-(1-(pyridin-4-ylmethyl)pip...)
Show SMILES CCOCCCn1c2ccccc2n(C2CCN(CC2)C(=O)C2CCN(Cc3ccncc3)CC2)c1=O
Show InChI InChI=1S/C29H39N5O3/c1-2-37-21-5-16-33-26-6-3-4-7-27(26)34(29(33)36)25-12-19-32(20-13-25)28(35)24-10-17-31(18-11-24)22-23-8-14-30-15-9-23/h3-4,6-9,14-15,24-25H,2,5,10-13,16-22H2,1H3
0.800n/an/an/an/an/an/an/an/a
Merck Research Laboratories
Curated by ChEMBL
Assay Description
Displacement of [3H]Nalpha-methylhistamine from histamine H3 receptor in guinea pig brain
Bioorg Med Chem Lett 20: 5004-8 (2010)
Article DOI: 10.1016/j.bmcl.2010.07.052
BindingDB Entry DOI: 10.7270/Q2N016QS
Cytochrome P450 3A4
(Homo sapiens (Human))
BDBM50325467
(1-(3-ethoxypropyl)-3-(1-(1-(pyridin-4-ylmethyl)pip...)
Show SMILES CCOCCCn1c2ccccc2n(C2CCN(CC2)C(=O)C2CCN(Cc3ccncc3)CC2)c1=O
Show InChI InChI=1S/C29H39N5O3/c1-2-37-21-5-16-33-26-6-3-4-7-27(26)34(29(33)36)25-12-19-32(20-13-25)28(35)24-10-17-31(18-11-24)22-23-8-14-30-15-9-23/h3-4,6-9,14-15,24-25H,2,5,10-13,16-22H2,1H3
Reactome pathway
n/an/a 1.06E+4n/an/an/an/an/an/a
Merck Research Laboratories
Curated by ChEMBL
Assay Description
Inhibition of CYP3A4 in human liver microsomes
Bioorg Med Chem Lett 20: 5004-8 (2010)
Article DOI: 10.1016/j.bmcl.2010.07.052
BindingDB Entry DOI: 10.7270/Q2N016QS
HRH3
(GUINEA PIG)
BDBM50325467
(1-(3-ethoxypropyl)-3-(1-(1-(pyridin-4-ylmethyl)pip...)
Show SMILES CCOCCCn1c2ccccc2n(C2CCN(CC2)C(=O)C2CCN(Cc3ccncc3)CC2)c1=O
Show InChI InChI=1S/C29H39N5O3/c1-2-37-21-5-16-33-26-6-3-4-7-27(26)34(29(33)36)25-12-19-32(20-13-25)28(35)24-10-17-31(18-11-24)22-23-8-14-30-15-9-23/h3-4,6-9,14-15,24-25H,2,5,10-13,16-22H2,1H3
n/an/an/a 3.16n/an/an/an/an/a
Merck Research Laboratories
Curated by ChEMBL
Assay Description
Antagonist activity at histamine H3 receptor in electrically-stimulated guinea pig ileum
Bioorg Med Chem Lett 20: 5004-8 (2010)
Article DOI: 10.1016/j.bmcl.2010.07.052
BindingDB Entry DOI: 10.7270/Q2N016QS
Cytochrome P450 2D6
(Homo sapiens (Human))
BDBM50325467
(1-(3-ethoxypropyl)-3-(1-(1-(pyridin-4-ylmethyl)pip...)
Show SMILES CCOCCCn1c2ccccc2n(C2CCN(CC2)C(=O)C2CCN(Cc3ccncc3)CC2)c1=O
Show InChI InChI=1S/C29H39N5O3/c1-2-37-21-5-16-33-26-6-3-4-7-27(26)34(29(33)36)25-12-19-32(20-13-25)28(35)24-10-17-31(18-11-24)22-23-8-14-30-15-9-23/h3-4,6-9,14-15,24-25H,2,5,10-13,16-22H2,1H3
n/an/a>2.00E+4n/an/an/an/an/an/a
Merck Research Laboratories
Curated by ChEMBL
Assay Description
Inhibition of CYP2D6 in human liver microsomes
Bioorg Med Chem Lett 20: 5004-8 (2010)
Article DOI: 10.1016/j.bmcl.2010.07.052
BindingDB Entry DOI: 10.7270/Q2N016QS