BDBM50325470 1-(2-ethoxyethyl)-3-(1-(1-(pyridin-4-ylmethyl)piperidine-4-carbonyl)piperidin-4-yl)-1H-benzo[d]imidazol-2(3H)-one::CHEMBL1222718
SMILES: CCOCCn1c2ccccc2n(C2CCN(CC2)C(=O)C2CCN(Cc3ccncc3)CC2)c1=O
InChI Key: InChIKey=FYAWQQTZMXAAFH-UHFFFAOYSA-N
Data: 1 KI  2 IC50  1 Kd
Activity Spreadsheet -- Enzyme Inhibition Constant Data from BindingDB
Found 4 hits for monomerid = 50325470
Trg + Lig
Ki
nM
ΔG°
kcal/mole
IC50
nM
Kd
nM
EC50/IC50
nM
koff
s-1
kon
M-1s-1
pHTemp
°C
HRH3
(GUINEA PIG)
BDBM50325470
(1-(2-ethoxyethyl)-3-(1-(1-(pyridin-4-ylmethyl)pipe...)
Show SMILES CCOCCn1c2ccccc2n(C2CCN(CC2)C(=O)C2CCN(Cc3ccncc3)CC2)c1=O
Show InChI InChI=1S/C28H37N5O3/c1-2-36-20-19-32-25-5-3-4-6-26(25)33(28(32)35)24-11-17-31(18-12-24)27(34)23-9-15-30(16-10-23)21-22-7-13-29-14-8-22/h3-8,13-14,23-24H,2,9-12,15-21H2,1H3
1.70n/an/an/an/an/an/an/an/a
Merck Research Laboratories
Curated by ChEMBL
Assay Description
Displacement of [3H]Nalpha-methylhistamine from histamine H3 receptor in guinea pig brain
Bioorg Med Chem Lett 20: 5004-8 (2010)
Article DOI: 10.1016/j.bmcl.2010.07.052
BindingDB Entry DOI: 10.7270/Q2N016QS
Cytochrome P450 3A4
(Homo sapiens (Human))
BDBM50325470
(1-(2-ethoxyethyl)-3-(1-(1-(pyridin-4-ylmethyl)pipe...)
Show SMILES CCOCCn1c2ccccc2n(C2CCN(CC2)C(=O)C2CCN(Cc3ccncc3)CC2)c1=O
Show InChI InChI=1S/C28H37N5O3/c1-2-36-20-19-32-25-5-3-4-6-26(25)33(28(32)35)24-11-17-31(18-12-24)27(34)23-9-15-30(16-10-23)21-22-7-13-29-14-8-22/h3-8,13-14,23-24H,2,9-12,15-21H2,1H3
Reactome pathway
n/an/a 1.35E+4n/an/an/an/an/an/a
Merck Research Laboratories
Curated by ChEMBL
Assay Description
Inhibition of CYP3A4 in human liver microsomes
Bioorg Med Chem Lett 20: 5004-8 (2010)
Article DOI: 10.1016/j.bmcl.2010.07.052
BindingDB Entry DOI: 10.7270/Q2N016QS
HRH3
(GUINEA PIG)
BDBM50325470
(1-(2-ethoxyethyl)-3-(1-(1-(pyridin-4-ylmethyl)pipe...)
Show SMILES CCOCCn1c2ccccc2n(C2CCN(CC2)C(=O)C2CCN(Cc3ccncc3)CC2)c1=O
Show InChI InChI=1S/C28H37N5O3/c1-2-36-20-19-32-25-5-3-4-6-26(25)33(28(32)35)24-11-17-31(18-12-24)27(34)23-9-15-30(16-10-23)21-22-7-13-29-14-8-22/h3-8,13-14,23-24H,2,9-12,15-21H2,1H3
n/an/an/a 2n/an/an/an/an/a
Merck Research Laboratories
Curated by ChEMBL
Assay Description
Antagonist activity at histamine H3 receptor in electrically-stimulated guinea pig ileum
Bioorg Med Chem Lett 20: 5004-8 (2010)
Article DOI: 10.1016/j.bmcl.2010.07.052
BindingDB Entry DOI: 10.7270/Q2N016QS
Cytochrome P450 2D6
(Homo sapiens (Human))
BDBM50325470
(1-(2-ethoxyethyl)-3-(1-(1-(pyridin-4-ylmethyl)pipe...)
Show SMILES CCOCCn1c2ccccc2n(C2CCN(CC2)C(=O)C2CCN(Cc3ccncc3)CC2)c1=O
Show InChI InChI=1S/C28H37N5O3/c1-2-36-20-19-32-25-5-3-4-6-26(25)33(28(32)35)24-11-17-31(18-12-24)27(34)23-9-15-30(16-10-23)21-22-7-13-29-14-8-22/h3-8,13-14,23-24H,2,9-12,15-21H2,1H3
n/an/a>2.00E+4n/an/an/an/an/an/a
Merck Research Laboratories
Curated by ChEMBL
Assay Description
Inhibition of CYP2D6 in human liver microsomes
Bioorg Med Chem Lett 20: 5004-8 (2010)
Article DOI: 10.1016/j.bmcl.2010.07.052
BindingDB Entry DOI: 10.7270/Q2N016QS