BDBM50325495 2-(4-isopropylphenyl)-4-methoxy-1-(2-methoxyethyl)-7-methyl-1H-benzo[d]imidazole::CHEMBL1223302
SMILES: COCCn1c(nc2c(OC)ccc(C)c12)-c1ccc(cc1)C(C)C
InChI Key: InChIKey=LPXOIVPEAIADKS-UHFFFAOYSA-N
Data: 1 IC50
Activity Spreadsheet -- Enzyme Inhibition Constant Data from BindingDB
Found 1 hit for monomerid = 50325495
Trg + Lig
Ki
nM
ΔG°
kcal/mole
IC50
nM
Kd
nM
EC50/IC50
nM
koff
s-1
kon
M-1s-1
pHTemp
°C
Calcium-sensing receptor (CaSR)
(Homo sapiens (Human))
BDBM50325495
(2-(4-isopropylphenyl)-4-methoxy-1-(2-methoxyethyl)...)
Show SMILES COCCn1c(nc2c(OC)ccc(C)c12)-c1ccc(cc1)C(C)C
Show InChI InChI=1S/C21H26N2O2/c1-14(2)16-7-9-17(10-8-16)21-22-19-18(25-5)11-6-15(3)20(19)23(21)12-13-24-4/h6-11,14H,12-13H2,1-5H3
n/an/a 1.90E+3n/an/an/an/an/an/a
Novartis Institutes for BioMedical Research
Curated by ChEMBL
Assay Description
Antagonist activity at human CaSR expressed in hamster fibroblasts assessed as inhibition of calcium mobilization
Bioorg Med Chem Lett 20: 5161-4 (2010)
Article DOI: 10.1016/j.bmcl.2010.07.016
BindingDB Entry DOI: 10.7270/Q2H70G1X