BDBM50325507 4,5-dibromo-2-(4-isopropylphenyl)-7-methoxy-1-(2-methoxyethyl)-1H-benzo[d]imidazole::CHEMBL1223505
SMILES: COCCn1c(nc2c(Br)c(Br)cc(OC)c12)-c1ccc(cc1)C(C)C
InChI Key: InChIKey=IYPVMDQHPOVNHW-UHFFFAOYSA-N
Data: 1 IC50
Activity Spreadsheet -- Enzyme Inhibition Constant Data from BindingDB
Found 1 hit for monomerid = 50325507
Trg + Lig
Ki
nM
ΔG°
kcal/mole
IC50
nM
Kd
nM
EC50/IC50
nM
koff
s-1
kon
M-1s-1
pHTemp
°C
Calcium-sensing receptor (CaSR)
(Homo sapiens (Human))
BDBM50325507
(4,5-dibromo-2-(4-isopropylphenyl)-7-methoxy-1-(2-m...)
Show SMILES COCCn1c(nc2c(Br)c(Br)cc(OC)c12)-c1ccc(cc1)C(C)C
Show InChI InChI=1S/C20H22Br2N2O2/c1-12(2)13-5-7-14(8-6-13)20-23-18-17(22)15(21)11-16(26-4)19(18)24(20)9-10-25-3/h5-8,11-12H,9-10H2,1-4H3
n/an/a 14n/an/an/an/an/an/a
Novartis Institutes for BioMedical Research
Curated by ChEMBL
Assay Description
Antagonist activity at human CaSR expressed in hamster fibroblasts assessed as inhibition of calcium mobilization
Bioorg Med Chem Lett 20: 5161-4 (2010)
Article DOI: 10.1016/j.bmcl.2010.07.016
BindingDB Entry DOI: 10.7270/Q2H70G1X