BDBM50325511 4-bromo-2-(4-isopropylphenyl)-7-methoxy-1-(2-methoxyethyl)-1H-benzo[d]imidazole-5-carbonitrile::CHEMBL1223509
SMILES: COCCn1c(nc2c(Br)c(cc(OC)c12)C#N)-c1ccc(cc1)C(C)C
InChI Key: InChIKey=MDBCFHWVBJBVPK-UHFFFAOYSA-N
Data: 1 IC50
Activity Spreadsheet -- Enzyme Inhibition Constant Data from BindingDB
Found 1 hit for monomerid = 50325511
Trg + Lig
Ki
nM
ΔG°
kcal/mole
IC50
nM
Kd
nM
EC50/IC50
nM
koff
s-1
kon
M-1s-1
pHTemp
°C
Calcium-sensing receptor (CaSR)
(Homo sapiens (Human))
BDBM50325511
(4-bromo-2-(4-isopropylphenyl)-7-methoxy-1-(2-metho...)
Show SMILES COCCn1c(nc2c(Br)c(cc(OC)c12)C#N)-c1ccc(cc1)C(C)C
Show InChI InChI=1S/C21H22BrN3O2/c1-13(2)14-5-7-15(8-6-14)21-24-19-18(22)16(12-23)11-17(27-4)20(19)25(21)9-10-26-3/h5-8,11,13H,9-10H2,1-4H3
n/an/a 25n/an/an/an/an/an/a
Novartis Institutes for BioMedical Research
Curated by ChEMBL
Assay Description
Antagonist activity at human CaSR expressed in hamster fibroblasts assessed as inhibition of calcium mobilization
Bioorg Med Chem Lett 20: 5161-4 (2010)
Article DOI: 10.1016/j.bmcl.2010.07.016
BindingDB Entry DOI: 10.7270/Q2H70G1X