BDBM50325733 (R)-1-(3-methoxyphenyl)-N-((4'-(trifluoromethyl)biphenyl-3-yl)methyl)ethanamine::CHEMBL1224264
SMILES: COc1cccc(c1)[C@@H](C)NCc1cccc(c1)-c1ccc(cc1)C(F)(F)F
InChI Key: InChIKey=GCCONIAQVTXXFL-MRXNPFEDSA-N
Data: 2 EC50
Activity Spreadsheet -- Enzyme Inhibition Constant Data from BindingDB
Found 2 hits for monomerid = 50325733
Trg + Lig
Ki
nM
ΔG°
kcal/mole
IC50
nM
Kd
nM
EC50/IC50
nM
koff
s-1
kon
M-1s-1
pHTemp
°C
Calcium-sensing receptor (CaSR)
(Homo sapiens (Human))
BDBM50325733
((R)-1-(3-methoxyphenyl)-N-((4'-(trifluoromethyl)bi...)
Show SMILES COc1cccc(c1)[C@@H](C)NCc1cccc(c1)-c1ccc(cc1)C(F)(F)F |r|
Show InChI InChI=1S/C23H22F3NO/c1-16(19-6-4-8-22(14-19)28-2)27-15-17-5-3-7-20(13-17)18-9-11-21(12-10-18)23(24,25)26/h3-14,16,27H,15H2,1-2H3/t16-/m1/s1
n/an/an/an/a>5.00E+3n/an/an/an/a
Amgen Inc.
Curated by ChEMBL
Assay Description
Positive allosteric modulation of calcium sensing receptor by FLIPR assay in absence of extracellular calcium
Bioorg Med Chem Lett 20: 5544-7 (2010)
Article DOI: 10.1016/j.bmcl.2010.07.060
BindingDB Entry DOI: 10.7270/Q2Z89CM3
Calcium-sensing receptor (CaSR)
(Homo sapiens (Human))
BDBM50325733
((R)-1-(3-methoxyphenyl)-N-((4'-(trifluoromethyl)bi...)
Show SMILES COc1cccc(c1)[C@@H](C)NCc1cccc(c1)-c1ccc(cc1)C(F)(F)F |r|
Show InChI InChI=1S/C23H22F3NO/c1-16(19-6-4-8-22(14-19)28-2)27-15-17-5-3-7-20(13-17)18-9-11-21(12-10-18)23(24,25)26/h3-14,16,27H,15H2,1-2H3/t16-/m1/s1
n/an/an/an/a 620n/an/an/an/a
Amgen Inc.
Curated by ChEMBL
Assay Description
Positive allosteric modulation of calcium sensing receptor by FLIPR assay in presence of extracellular calcium
Bioorg Med Chem Lett 20: 5544-7 (2010)
Article DOI: 10.1016/j.bmcl.2010.07.060
BindingDB Entry DOI: 10.7270/Q2Z89CM3