BDBM50325862 CHEMBL1224067::endo-4-((1R,5S)-8-benzyl-8-azabicyclo[3.2.1]octan-3-yloxy)picolinamide
SMILES: NC(=O)c1cc(O[C@@H]2C[C@@H]3CC[C@H](C2)N3Cc2ccccc2)ccn1
InChI Key: InChIKey=KDYAEPCFPWDFLK-VQFNDLOPSA-N
Data: 2 IC50
Activity Spreadsheet -- Enzyme Inhibition Constant Data from BindingDB
Found 2 hits for monomerid = 50325862
Trg + Lig
Ki
nM
ΔG°
kcal/mole
IC50
nM
Kd
nM
EC50/IC50
nM
koff
s-1
kon
M-1s-1
pHTemp
°C
Potassium voltage-gated channel subfamily H member 2
(Homo sapiens (Human))
BDBM50325862
(CHEMBL1224067 | endo-4-((1R,5S)-8-benzyl-8-azabicy...)
Show SMILES NC(=O)c1cc(O[C@@H]2C[C@@H]3CC[C@H](C2)N3Cc2ccccc2)ccn1 |r,TLB:15:14:13.7.8:11.10|
Show InChI InChI=1S/C20H23N3O2/c21-20(24)19-12-17(8-9-22-19)25-18-10-15-6-7-16(11-18)23(15)13-14-4-2-1-3-5-14/h1-5,8-9,12,15-16,18H,6-7,10-11,13H2,(H2,21,24)/t15-,16+,18+
Reactome pathway
n/an/a 1.60E+3n/an/an/an/an/an/a
AstraZeneca Pharmaceuticals
Curated by ChEMBL
Assay Description
Inhibition of human ERG by electrophysiology assay
Bioorg Med Chem Lett 20: 5405-10 (2010)
Article DOI: 10.1016/j.bmcl.2010.07.112
BindingDB Entry DOI: 10.7270/Q2X92BHQ
Kappa-type opioid receptor
(Homo sapiens (Human))
BDBM50325862
(CHEMBL1224067 | endo-4-((1R,5S)-8-benzyl-8-azabicy...)
Show SMILES NC(=O)c1cc(O[C@@H]2C[C@@H]3CC[C@H](C2)N3Cc2ccccc2)ccn1 |r,TLB:15:14:13.7.8:11.10|
Show InChI InChI=1S/C20H23N3O2/c21-20(24)19-12-17(8-9-22-19)25-18-10-15-6-7-16(11-18)23(15)13-14-4-2-1-3-5-14/h1-5,8-9,12,15-16,18H,6-7,10-11,13H2,(H2,21,24)/t15-,16+,18+
Reactome pathway
n/an/a 1.42E+4n/an/an/an/an/an/a
AstraZeneca Pharmaceuticals
Curated by ChEMBL
Assay Description
Antagonist activity at human kappa opioid receptor expressed in HEK cells assessed as inhibition of dynorphin A-induced [35S]GTPgammaS binding
Bioorg Med Chem Lett 20: 5405-10 (2010)
Article DOI: 10.1016/j.bmcl.2010.07.112
BindingDB Entry DOI: 10.7270/Q2X92BHQ