BDBM50325871 CHEMBL1224215::endo-4-((1R,5S)-8-benzyl-8-azabicyclo[3.2.1]octan-3-yloxy)-3-methylbenzamide
SMILES: Cc1cc(ccc1O[C@@H]1C[C@@H]2CC[C@H](C1)N2Cc1ccccc1)C(N)=O
InChI Key: InChIKey=DIBOAEDLUWGCBT-PMOLBWCYSA-N
Data: 3 IC50
Activity Spreadsheet -- Enzyme Inhibition Constant Data from BindingDB
Found 3 hits for monomerid = 50325871
Trg + Lig
Ki
nM
ΔG°
kcal/mole
IC50
nM
Kd
nM
EC50/IC50
nM
koff
s-1
kon
M-1s-1
pHTemp
°C
Kappa-type opioid receptor
(Homo sapiens (Human))
BDBM50325871
(CHEMBL1224215 | endo-4-((1R,5S)-8-benzyl-8-azabicy...)
Show SMILES Cc1cc(ccc1O[C@@H]1C[C@@H]2CC[C@H](C1)N2Cc1ccccc1)C(N)=O |r,TLB:16:15:14.8.9:12.11|
Show InChI InChI=1S/C22H26N2O2/c1-15-11-17(22(23)25)7-10-21(15)26-20-12-18-8-9-19(13-20)24(18)14-16-5-3-2-4-6-16/h2-7,10-11,18-20H,8-9,12-14H2,1H3,(H2,23,25)/t18-,19+,20+
Reactome pathway
n/an/a 462n/an/an/an/an/an/a
AstraZeneca Pharmaceuticals
Curated by ChEMBL
Assay Description
Antagonist activity at human kappa opioid receptor expressed in HEK cells assessed as inhibition of dynorphin A-induced [35S]GTPgammaS binding
Bioorg Med Chem Lett 20: 5405-10 (2010)
Article DOI: 10.1016/j.bmcl.2010.07.112
BindingDB Entry DOI: 10.7270/Q2X92BHQ
Potassium voltage-gated channel subfamily H member 2
(Homo sapiens (Human))
BDBM50325871
(CHEMBL1224215 | endo-4-((1R,5S)-8-benzyl-8-azabicy...)
Show SMILES Cc1cc(ccc1O[C@@H]1C[C@@H]2CC[C@H](C1)N2Cc1ccccc1)C(N)=O |r,TLB:16:15:14.8.9:12.11|
Show InChI InChI=1S/C22H26N2O2/c1-15-11-17(22(23)25)7-10-21(15)26-20-12-18-8-9-19(13-20)24(18)14-16-5-3-2-4-6-16/h2-7,10-11,18-20H,8-9,12-14H2,1H3,(H2,23,25)/t18-,19+,20+
Reactome pathway
n/an/a 1.00E+3n/an/an/an/an/an/a
AstraZeneca Pharmaceuticals
Curated by ChEMBL
Assay Description
Inhibition of human ERG by electrophysiology assay
Bioorg Med Chem Lett 20: 5405-10 (2010)
Article DOI: 10.1016/j.bmcl.2010.07.112
BindingDB Entry DOI: 10.7270/Q2X92BHQ
Mu-type opioid receptor
(Homo sapiens (Human))
BDBM50325871
(CHEMBL1224215 | endo-4-((1R,5S)-8-benzyl-8-azabicy...)
Show SMILES Cc1cc(ccc1O[C@@H]1C[C@@H]2CC[C@H](C1)N2Cc1ccccc1)C(N)=O |r,TLB:16:15:14.8.9:12.11|
Show InChI InChI=1S/C22H26N2O2/c1-15-11-17(22(23)25)7-10-21(15)26-20-12-18-8-9-19(13-20)24(18)14-16-5-3-2-4-6-16/h2-7,10-11,18-20H,8-9,12-14H2,1H3,(H2,23,25)/t18-,19+,20+
NCI pathway
Reactome pathway
n/an/a 419n/an/an/an/an/an/a
AstraZeneca Pharmaceuticals
Curated by ChEMBL
Assay Description
Antagonist activity at human mu opioid receptor expressed in HEK cells assessed as inhibition of DAMGO-induced [35S]GTPgammaS binding
Bioorg Med Chem Lett 20: 5405-10 (2010)
Article DOI: 10.1016/j.bmcl.2010.07.112
BindingDB Entry DOI: 10.7270/Q2X92BHQ