BDBM50325881 CHEMBL1224372::N-(1-((4'-fluoro-2'-methoxybiphenyl-3-yl)methyl)-1H-benzo[d]imidazol-6-yl)pivalamide
SMILES: COc1cc(F)ccc1-c1cccc(Cn2cnc3ccc(NC(=O)C(C)(C)C)cc23)c1
InChI Key: InChIKey=HFKPAYACHZPHBN-UHFFFAOYSA-N
Data: 1 IC50
Activity Spreadsheet -- Enzyme Inhibition Constant Data from BindingDB
Found 1 hit for monomerid = 50325881
Trg + Lig
Ki
nM
ΔG°
kcal/mole
IC50
nM
Kd
nM
EC50/IC50
nM
koff
s-1
kon
M-1s-1
pHTemp
°C
Cannabinoid receptor 1
(Homo sapiens (Human))
BDBM50325881
(CHEMBL1224372 | N-(1-((4'-fluoro-2'-methoxybipheny...)
Show SMILES COc1cc(F)ccc1-c1cccc(Cn2cnc3ccc(NC(=O)C(C)(C)C)cc23)c1
Show InChI InChI=1S/C26H26FN3O2/c1-26(2,3)25(31)29-20-9-11-22-23(14-20)30(16-28-22)15-17-6-5-7-18(12-17)21-10-8-19(27)13-24(21)32-4/h5-14,16H,15H2,1-4H3,(H,29,31)
NCI pathway
Reactome pathway
n/an/a 269n/an/an/an/an/an/a
Ligand Pharmaceuticals, Inc.
Curated by ChEMBL
Assay Description
Displacement of [3H]CC55940 human cannabinoid CB1 receptor expressed in CHO cells by luciferase reporter gene assay
Bioorg Med Chem Lett 20: 5449-53 (2010)
Article DOI: 10.1016/j.bmcl.2010.07.091
BindingDB Entry DOI: 10.7270/Q2SN0958