null
SMILES: CC(C)(O)CC(=O)Nc1ccc2ccn(Cc3cccc(n3)-c3cccc4OCOc34)c2c1
InChI Key: InChIKey=QARUVMOUXQJRHQ-UHFFFAOYSA-N
Activity Spreadsheet -- Enzyme Inhibition Constant Data from BindingDB
Found 1 hit for monomerid = 50325890
Trg + Lig
Ki
nM
ΔG°
kcal/mole
IC50
nM
Kd
nM
EC50/IC50
nM
koff
s-1
kon
M-1s-1
pHTemp
°C
Cannabinoid receptor 1
(Homo sapiens (Human))
BDBM50325890
(CHEMBL1224536 | N-(1-((6-(benzo[d][1,3]dioxol-4-yl...)
Show SMILES CC(C)(O)CC(=O)Nc1ccc2ccn(Cc3cccc(n3)-c3cccc4OCOc34)c2c1
Show InChI InChI=1S/C26H25N3O4/c1-26(2,31)14-24(30)28-18-10-9-17-11-12-29(22(17)13-18)15-19-5-3-7-21(27-19)20-6-4-8-23-25(20)33-16-32-23/h3-13,31H,14-16H2,1-2H3,(H,28,30)
NCI pathway
Reactome pathway
n/an/a 3n/an/an/an/an/an/a
Ligand Pharmaceuticals, Inc.
Curated by ChEMBL
Assay Description
Displacement of [3H]CC55940 human cannabinoid CB1 receptor expressed in CHO cells by luciferase reporter gene assay
Bioorg Med Chem Lett 20: 5449-53 (2010)
Article DOI: 10.1016/j.bmcl.2010.07.091
BindingDB Entry DOI: 10.7270/Q2SN0958