BDBM50326022 CHEMBL1240698
SMILES: [#6]-[#6]-[#6@H](-[#6])-[#6@H](-[#7]-[#6](=O)-[#6@H](-[#6]-[#6]-[#6](-[#8])=O)-[#7]-[#6](=O)-[#6@@H](-[#7]-[#6](=O)-[#6@@H]-1-[#6]-[#6]-[#6]-[#7]-1-[#6](=O)-[#6@H](-[#6]-[#16])-[#7]-[#6](=O)-[#6@H](-[#6]-c1ccc(-[#8])cc1)-[#7]-[#6](=O)-[#6@H](-[#6]-[#6]-[#6]\[#7]=[#6](/[#7])-[#7])-[#7]-[#6](=O)-[#6@H](-[#6]-[#6]-[#6]\[#7]=[#6](/[#7])-[#7])-[#7]-[#6](=O)-[#6@H](-[#6]-[#6]-[#6](-[#8])=O)-[#7]-[#6](=O)-[#6](-[#7]-[#6](=O)-[#6@H](-[#6]-[#8])-[#7]-[#6](=O)-[#6@H](-[#6]-[#16])-[#7]-[#6](=O)-[#6@H](-[#6])-[#7])-[#6@@H](-[#6])-[#8])-[#6@@H](-[#6])-[#6]-[#6])-[#6](=O)-[#7]-[#6@@H](-[#6]-c1ccccc1)-[#6](=O)-[#7]-1-[#6]-[#6]-[#6]-[#6@H]-1-[#6](=O)-[#7]-[#6@@H](-[#6]-[#16])-[#6](=O)-[#7]-[#6]-[#6](-[#7])=O
InChI Key: InChIKey=MRHOQWMKYGJTRH-HPNNBLMSSA-N
Data: 1 IC50
Activity Spreadsheet -- Enzyme Inhibition Constant Data from BindingDB
Found 1 hit for monomerid = 50326022
Trg + Lig
Ki
nM
ΔG°
kcal/mole
IC50
nM
Kd
nM
EC50/IC50
nM
koff
s-1
kon
M-1s-1
pHTemp
°C
Plasma kallikrein
(Homo sapiens (Human))
BDBM50326022
(CHEMBL1240698)
Show SMILES [#6]-[#6]-[#6@H](-[#6])-[#6@H](-[#7]-[#6](=O)-[#6@H](-[#6]-[#6]-[#6](-[#8])=O)-[#7]-[#6](=O)-[#6@@H](-[#7]-[#6](=O)-[#6@@H]-1-[#6]-[#6]-[#6]-[#7]-1-[#6](=O)-[#6@H](-[#6]-[#16])-[#7]-[#6](=O)-[#6@H](-[#6]-c1ccc(-[#8])cc1)-[#7]-[#6](=O)-[#6@H](-[#6]-[#6]-[#6]\[#7]=[#6](/[#7])-[#7])-[#7]-[#6](=O)-[#6@H](-[#6]-[#6]-[#6]\[#7]=[#6](/[#7])-[#7])-[#7]-[#6](=O)-[#6@H](-[#6]-[#6]-[#6](-[#8])=O)-[#7]-[#6](=O)-[#6](-[#7]-[#6](=O)-[#6@H](-[#6]-[#8])-[#7]-[#6](=O)-[#6@H](-[#6]-[#16])-[#7]-[#6](=O)-[#6@H](-[#6])-[#7])-[#6@@H](-[#6])-[#8])-[#6@@H](-[#6])-[#6]-[#6])-[#6](=O)-[#7]-[#6@@H](-[#6]-c1ccccc1)-[#6](=O)-[#7]-1-[#6]-[#6]-[#6]-[#6@H]-1-[#6](=O)-[#7]-[#6@@H](-[#6]-[#16])-[#6](=O)-[#7]-[#6]-[#6](-[#7])=O |r|
Show InChI InChI=1S/C83H130N24O24S3/c1-7-41(3)63(78(128)98-53(35-45-16-10-9-11-17-45)80(130)106-32-14-20-58(106)75(125)101-55(38-132)67(117)92-36-60(85)111)103-71(121)51(27-29-62(114)115)95-77(127)64(42(4)8-2)104-76(126)59-21-15-33-107(59)81(131)57(40-134)102-72(122)52(34-46-22-24-47(110)25-23-46)97-69(119)49(19-13-31-91-83(88)89)93-68(118)48(18-12-30-90-82(86)87)94-70(120)50(26-28-61(112)113)96-79(129)65(44(6)109)105-73(123)54(37-108)99-74(124)56(39-133)100-66(116)43(5)84/h9-11,16-17,22-25,41-44,48-59,63-65,108-110,132-134H,7-8,12-15,18-21,26-40,84H2,1-6H3,(H2,85,111)(H,92,117)(H,93,118)(H,94,120)(H,95,127)(H,96,129)(H,97,119)(H,98,128)(H,99,124)(H,100,116)(H,101,125)(H,102,122)(H,103,121)(H,104,126)(H,105,123)(H,112,113)(H,114,115)(H4,86,87,90)(H4,88,89,91)/t41-,42-,43-,44+,48-,49-,50-,51-,52-,53-,54-,55-,56-,57-,58-,59-,63-,64-,65?/m0/s1
n/an/a 7.18E+3n/an/an/an/an/an/a
Laboratory of Molecular Biology, Medical Research Council
Curated by ChEMBL
Assay Description
Inhibition of human plasma kallikrein using Z-Phe-Arg-AMC substrate after 30 mins by spectrophotometric assay
Nat Chem Biol 5: 502-7 (2009)
Article DOI: 10.1038/nchembio.184
BindingDB Entry DOI: 10.7270/Q2Z60P9P