BDBM50326159 8-[2-(4-Carboxyphenyl)thiazol-4-yl]dibenzo[b,d]furan-4-carboxylic acid::CHEMBL1242735
SMILES: OC(=O)c1ccc(cc1)-c1nc(cs1)-c1ccc2oc3c(cccc3c2c1)C(O)=O
InChI Key: InChIKey=OLLCUWXYFSWOKO-UHFFFAOYSA-N
Data: 3 IC50
Activity Spreadsheet -- Enzyme Inhibition Constant Data from BindingDB
Found 3 hits for monomerid = 50326159
Trg + Lig
Ki
nM
ΔG°
kcal/mole
IC50
nM
Kd
nM
EC50/IC50
nM
koff
s-1
kon
M-1s-1
pHTemp
°C
Protein-tyrosine phosphatase 1B
(Homo sapiens (Human))
BDBM50326159
(8-[2-(4-Carboxyphenyl)thiazol-4-yl]dibenzo[b,d]fur...)
Show SMILES OC(=O)c1ccc(cc1)-c1nc(cs1)-c1ccc2oc3c(cccc3c2c1)C(O)=O
Show InChI InChI=1S/C23H13NO5S/c25-22(26)13-6-4-12(5-7-13)21-24-18(11-30-21)14-8-9-19-17(10-14)15-2-1-3-16(23(27)28)20(15)29-19/h1-11H,(H,25,26)(H,27,28)
NCI pathway
Reactome pathway
n/an/a 388n/an/an/an/an/an/a
Glenmark Research Center
Curated by ChEMBL
Assay Description
Inhibition of human recombinant PTP1B after 30 mins by spectrophotometry
Eur J Med Chem 45: 3709-18 (2010)
Article DOI: 10.1016/j.ejmech.2010.05.020
BindingDB Entry DOI: 10.7270/Q24Q7V6S
Receptor-type tyrosine-protein phosphatase F (LAR)
(Homo sapiens (Human))
BDBM50326159
(8-[2-(4-Carboxyphenyl)thiazol-4-yl]dibenzo[b,d]fur...)
Show SMILES OC(=O)c1ccc(cc1)-c1nc(cs1)-c1ccc2oc3c(cccc3c2c1)C(O)=O
Show InChI InChI=1S/C23H13NO5S/c25-22(26)13-6-4-12(5-7-13)21-24-18(11-30-21)14-8-9-19-17(10-14)15-2-1-3-16(23(27)28)20(15)29-19/h1-11H,(H,25,26)(H,27,28)
n/an/a 3.25E+3n/an/an/an/an/an/a
Glenmark Research Center
Curated by ChEMBL
Assay Description
Inhibition of human recombinant LAR after 30 mins by spectrophotometry
Eur J Med Chem 45: 3709-18 (2010)
Article DOI: 10.1016/j.ejmech.2010.05.020
BindingDB Entry DOI: 10.7270/Q24Q7V6S
Tyrosine-protein phosphatase non-receptor type 2
(Homo sapiens (Human))
BDBM50326159
(8-[2-(4-Carboxyphenyl)thiazol-4-yl]dibenzo[b,d]fur...)
Show SMILES OC(=O)c1ccc(cc1)-c1nc(cs1)-c1ccc2oc3c(cccc3c2c1)C(O)=O
Show InChI InChI=1S/C23H13NO5S/c25-22(26)13-6-4-12(5-7-13)21-24-18(11-30-21)14-8-9-19-17(10-14)15-2-1-3-16(23(27)28)20(15)29-19/h1-11H,(H,25,26)(H,27,28)
n/an/a 2.10E+3n/an/an/an/an/an/a
Glenmark Research Center
Curated by ChEMBL
Assay Description
Inhibition of human recombinant TCPTP after 30 mins by spectrophotometry
Eur J Med Chem 45: 3709-18 (2010)
Article DOI: 10.1016/j.ejmech.2010.05.020
BindingDB Entry DOI: 10.7270/Q24Q7V6S