BDBM50326226 CHEMBL1243358::N-{1-[3-(7-Fluoro-2-oxo-3,4-dihydro-2H-quinolin-1-yl)-propyl]-piperidin-4-yl}-propionamide
SMILES: CCC(=O)NC1CCN(CCCN2C(=O)CCc3ccc(F)cc23)CC1
InChI Key: InChIKey=WPCKTNFWQWAXOM-UHFFFAOYSA-N
Data: 1 EC50
Activity Spreadsheet -- Enzyme Inhibition Constant Data from BindingDB
Found 1 hit for monomerid = 50326226
Trg + Lig
Ki
nM
ΔG°
kcal/mole
IC50
nM
Kd
nM
EC50/IC50
nM
koff
s-1
kon
M-1s-1
pHTemp
°C
Muscarinic acetylcholine receptor M1
(Homo sapiens (Human))
BDBM50326226
(CHEMBL1243358 | N-{1-[3-(7-Fluoro-2-oxo-3,4-dihydr...)
Show SMILES CCC(=O)NC1CCN(CCCN2C(=O)CCc3ccc(F)cc23)CC1
Show InChI InChI=1S/C20H28FN3O2/c1-2-19(25)22-17-8-12-23(13-9-17)10-3-11-24-18-14-16(21)6-4-15(18)5-7-20(24)26/h4,6,14,17H,2-3,5,7-13H2,1H3,(H,22,25)
n/an/an/an/a 20n/an/an/an/a
H. Lundbeck A/S
Curated by ChEMBL
Assay Description
Agonist activity at human muscarinic M1 receptor expressed in CHO-K1 cells assessed as increase of acetylcholine-induced calcium flux by FLIPR assay
J Med Chem 53: 6386-97 (2010)
Article DOI: 10.1021/jm100697g
BindingDB Entry DOI: 10.7270/Q2765G9K