BDBM50326540 (R)-N-(5-chloro-2-hydroxybenzyl)-2-(3-(2-(2-hydroxy-2-(4-hydroxy-3-(methylsulfonamido)phenyl)ethylamino)-2-methylpropyl)phenyl)acetamide::CHEMBL1243000
SMILES: CC(C)(Cc1cccc(CC(=O)NCc2cc(Cl)ccc2O)c1)NC[C@H](O)c1ccc(O)c(NS(C)(=O)=O)c1
InChI Key: InChIKey=PIHHGNUFNUKUEX-SANMLTNESA-N
Data: 1 EC50
Activity Spreadsheet -- Enzyme Inhibition Constant Data from BindingDB
Found 1 hit for monomerid = 50326540
Trg + Lig
Ki
nM
ΔG°
kcal/mole
IC50
nM
Kd
nM
EC50/IC50
nM
koff
s-1
kon
M-1s-1
pHTemp
°C
Beta-2 adrenergic receptor
(Homo sapiens (Human))
BDBM50326540
((R)-N-(5-chloro-2-hydroxybenzyl)-2-(3-(2-(2-hydrox...)
Show SMILES CC(C)(Cc1cccc(CC(=O)NCc2cc(Cl)ccc2O)c1)NC[C@H](O)c1ccc(O)c(NS(C)(=O)=O)c1 |r|
Show InChI InChI=1S/C28H34ClN3O6S/c1-28(2,31-17-26(35)20-7-9-25(34)23(14-20)32-39(3,37)38)15-19-6-4-5-18(11-19)12-27(36)30-16-21-13-22(29)8-10-24(21)33/h4-11,13-14,26,31-35H,12,15-17H2,1-3H3,(H,30,36)/t26-/m0/s1
Reactome pathway
n/an/an/an/a 0.170n/an/an/an/a
Pfizer Inc.
Curated by ChEMBL
Assay Description
Agonist activity at human recombinant beta2 adrenergic receptor expressed in CHO cells assessed as elevation in cAMP level after 1 hr by flashplate m...
J Med Chem 53: 6640-52 (2010)
Article DOI: 10.1021/jm1005989
BindingDB Entry DOI: 10.7270/Q2X0678R