BDBM50326541 (R)-N-(3,5-dichloro-2-hydroxybenzyl)-2-(3-(2-(2-hydroxy-2-(4-hydroxy-3-(methylsulfonamido)phenyl)ethylamino)-2-methylpropyl)phenyl)acetamide::CHEMBL1243035
SMILES: CC(C)(Cc1cccc(CC(=O)NCc2cc(Cl)cc(Cl)c2O)c1)NC[C@H](O)c1ccc(O)c(NS(C)(=O)=O)c1
InChI Key: InChIKey=UQXAYUDUCJABOF-VWLOTQADSA-N
Data: 1 EC50
Activity Spreadsheet -- Enzyme Inhibition Constant Data from BindingDB
Found 1 hit for monomerid = 50326541
Trg + Lig
Ki
nM
ΔG°
kcal/mole
IC50
nM
Kd
nM
EC50/IC50
nM
koff
s-1
kon
M-1s-1
pHTemp
°C
Beta-2 adrenergic receptor
(Homo sapiens (Human))
BDBM50326541
((R)-N-(3,5-dichloro-2-hydroxybenzyl)-2-(3-(2-(2-hy...)
Show SMILES CC(C)(Cc1cccc(CC(=O)NCc2cc(Cl)cc(Cl)c2O)c1)NC[C@H](O)c1ccc(O)c(NS(C)(=O)=O)c1 |r|
Show InChI InChI=1S/C28H33Cl2N3O6S/c1-28(2,32-16-25(35)19-7-8-24(34)23(12-19)33-40(3,38)39)14-18-6-4-5-17(9-18)10-26(36)31-15-20-11-21(29)13-22(30)27(20)37/h4-9,11-13,25,32-35,37H,10,14-16H2,1-3H3,(H,31,36)/t25-/m0/s1
Reactome pathway
n/an/an/an/a 0.130n/an/an/an/a
Pfizer Inc.
Curated by ChEMBL
Assay Description
Agonist activity at human recombinant beta2 adrenergic receptor expressed in CHO cells assessed as elevation in cAMP level after 1 hr by flashplate m...
J Med Chem 53: 6640-52 (2010)
Article DOI: 10.1021/jm1005989
BindingDB Entry DOI: 10.7270/Q2X0678R