BDBM50326550 CHEMBL1243317::N-(3,4-dimethylbenzyl)-2-(3-((R)-2-((R)-2-hydroxy-2-(4-hydroxy-3-(methylsulfonamido)phenyl)ethylamino)propyl)phenyl)acetamide
SMILES: C[C@H](Cc1cccc(CC(=O)NCc2ccc(C)c(C)c2)c1)NC[C@H](O)c1ccc(O)c(NS(C)(=O)=O)c1
InChI Key: InChIKey=XCDHVLSPYCOLFS-PIKZIKFNSA-N
Data: 1 EC50
Activity Spreadsheet -- Enzyme Inhibition Constant Data from BindingDB
Found 1 hit for monomerid = 50326550
Trg + Lig
Ki
nM
ΔG°
kcal/mole
IC50
nM
Kd
nM
EC50/IC50
nM
koff
s-1
kon
M-1s-1
pHTemp
°C
Beta-2 adrenergic receptor
(Homo sapiens (Human))
BDBM50326550
(CHEMBL1243317 | N-(3,4-dimethylbenzyl)-2-(3-((R)-2...)
Show SMILES C[C@H](Cc1cccc(CC(=O)NCc2ccc(C)c(C)c2)c1)NC[C@H](O)c1ccc(O)c(NS(C)(=O)=O)c1 |r|
Show InChI InChI=1S/C29H37N3O5S/c1-19-8-9-24(12-20(19)2)17-31-29(35)15-23-7-5-6-22(14-23)13-21(3)30-18-28(34)25-10-11-27(33)26(16-25)32-38(4,36)37/h5-12,14,16,21,28,30,32-34H,13,15,17-18H2,1-4H3,(H,31,35)/t21-,28+/m1/s1
Reactome pathway
n/an/an/an/a 0.0600n/an/an/an/a
Pfizer Inc.
Curated by ChEMBL
Assay Description
Agonist activity at human recombinant beta2 adrenergic receptor expressed in CHO cells assessed as elevation in cAMP level after 1 hr by flashplate m...
J Med Chem 53: 6640-52 (2010)
Article DOI: 10.1021/jm1005989
BindingDB Entry DOI: 10.7270/Q2X0678R