BDBM50326555 (R)-N-benzyl-2-(3-(2-(2-hydroxy-2-(4-hydroxy-3-(methylsulfonamido)phenyl)ethylamino)-2-methylpropyl)phenyl)acetamide::CHEMBL1243189
SMILES: CC(C)(Cc1cccc(CC(=O)NCc2ccccc2)c1)NC[C@H](O)c1ccc(O)c(NS(C)(=O)=O)c1
InChI Key: InChIKey=VUAYCOBWTWJBCO-SANMLTNESA-N
Data: 1 EC50
Activity Spreadsheet -- Enzyme Inhibition Constant Data from BindingDB
Found 1 hit for monomerid = 50326555
Trg + Lig
Ki
nM
ΔG°
kcal/mole
IC50
nM
Kd
nM
EC50/IC50
nM
koff
s-1
kon
M-1s-1
pHTemp
°C
Beta-2 adrenergic receptor
(Homo sapiens (Human))
BDBM50326555
((R)-N-benzyl-2-(3-(2-(2-hydroxy-2-(4-hydroxy-3-(me...)
Show SMILES CC(C)(Cc1cccc(CC(=O)NCc2ccccc2)c1)NC[C@H](O)c1ccc(O)c(NS(C)(=O)=O)c1 |r|
Show InChI InChI=1S/C28H35N3O5S/c1-28(2,30-19-26(33)23-12-13-25(32)24(16-23)31-37(3,35)36)17-22-11-7-10-21(14-22)15-27(34)29-18-20-8-5-4-6-9-20/h4-14,16,26,30-33H,15,17-19H2,1-3H3,(H,29,34)/t26-/m0/s1
Reactome pathway
n/an/an/an/a 0.0200n/an/an/an/a
Pfizer Inc.
Curated by ChEMBL
Assay Description
Agonist activity at human recombinant beta2 adrenergic receptor expressed in CHO cells assessed as elevation in cAMP level after 1 hr by flashplate m...
J Med Chem 53: 6640-52 (2010)
Article DOI: 10.1021/jm1005989
BindingDB Entry DOI: 10.7270/Q2X0678R