BDBM50326937 1,1,1-Trifluoro-4-(5-fluoro-2-methoxyphenyl)-4-methyl-2-(1H-pyrrolo[2,3-b]pyridin-2-ylmethyl)pentan-2-ol::CHEMBL1254652
SMILES: COc1ccc(F)cc1C(C)(C)CC(O)(Cc1cc2cccnc2[nH]1)C(F)(F)F
InChI Key: InChIKey=WFIFLFARTXGDFP-UHFFFAOYSA-N
Data: 4 IC50
Activity Spreadsheet -- Enzyme Inhibition Constant Data from BindingDB
Found 4 hits for monomerid = 50326937
Trg + Lig
Ki
nM
ΔG°
kcal/mole
IC50
nM
Kd
nM
EC50/IC50
nM
koff
s-1
kon
M-1s-1
pHTemp
°C
Glucocorticoid receptor
(Homo sapiens (Human))
BDBM50326937
(1,1,1-Trifluoro-4-(5-fluoro-2-methoxyphenyl)-4-met...)
Show SMILES COc1ccc(F)cc1C(C)(C)CC(O)(Cc1cc2cccnc2[nH]1)C(F)(F)F
Show InChI InChI=1S/C21H22F4N2O2/c1-19(2,16-10-14(22)6-7-17(16)29-3)12-20(28,21(23,24)25)11-15-9-13-5-4-8-26-18(13)27-15/h4-10,28H,11-12H2,1-3H3,(H,26,27)
n/an/a 21n/an/an/an/an/an/a
Boehringer-Ingelheim Pharmaceuticals Inc.
Curated by ChEMBL
Assay Description
Binding affinity to glucocorticoid receptor expressed in baculovirus-infected insect cells using tetramethylrhodamine labeled Dexamethasone by fluore...
J Med Chem 53: 6681-98 (2010)
Article DOI: 10.1021/jm100751q
BindingDB Entry DOI: 10.7270/Q2571D0X
Glucocorticoid receptor
(Homo sapiens (Human))
BDBM50326937
(1,1,1-Trifluoro-4-(5-fluoro-2-methoxyphenyl)-4-met...)
Show SMILES COc1ccc(F)cc1C(C)(C)CC(O)(Cc1cc2cccnc2[nH]1)C(F)(F)F
Show InChI InChI=1S/C21H22F4N2O2/c1-19(2,16-10-14(22)6-7-17(16)29-3)12-20(28,21(23,24)25)11-15-9-13-5-4-8-26-18(13)27-15/h4-10,28H,11-12H2,1-3H3,(H,26,27)
n/an/a>2.00E+3n/an/an/an/an/an/a
Boehringer-Ingelheim Pharmaceuticals Inc.
Curated by ChEMBL
Assay Description
Transrepression activity at glucocorticoid receptor in HFF assessed as inhibition of IL-1-induced IL-6 production after 18 to 24 hrs by ELISA
J Med Chem 53: 6681-98 (2010)
Article DOI: 10.1021/jm100751q
BindingDB Entry DOI: 10.7270/Q2571D0X
Progesterone receptor
(Homo sapiens (Human))
BDBM50326937
(1,1,1-Trifluoro-4-(5-fluoro-2-methoxyphenyl)-4-met...)
Show SMILES COc1ccc(F)cc1C(C)(C)CC(O)(Cc1cc2cccnc2[nH]1)C(F)(F)F
Show InChI InChI=1S/C21H22F4N2O2/c1-19(2,16-10-14(22)6-7-17(16)29-3)12-20(28,21(23,24)25)11-15-9-13-5-4-8-26-18(13)27-15/h4-10,28H,11-12H2,1-3H3,(H,26,27)
n/an/a>2.00E+3n/an/an/an/an/an/a
Boehringer-Ingelheim Pharmaceuticals Inc.
Curated by ChEMBL
Assay Description
Binding affinity to progesterone receptor expressed in baculovirus-infected insect cells using tetramethylrhodamine labeled RU-486 by fluorescence po...
J Med Chem 53: 6681-98 (2010)
Article DOI: 10.1021/jm100751q
BindingDB Entry DOI: 10.7270/Q2571D0X
Mineralocorticoid receptor
(Homo sapiens (Human))
BDBM50326937
(1,1,1-Trifluoro-4-(5-fluoro-2-methoxyphenyl)-4-met...)
Show SMILES COc1ccc(F)cc1C(C)(C)CC(O)(Cc1cc2cccnc2[nH]1)C(F)(F)F
Show InChI InChI=1S/C21H22F4N2O2/c1-19(2,16-10-14(22)6-7-17(16)29-3)12-20(28,21(23,24)25)11-15-9-13-5-4-8-26-18(13)27-15/h4-10,28H,11-12H2,1-3H3,(H,26,27)
n/an/a 910n/an/an/an/an/an/a
Boehringer-Ingelheim Pharmaceuticals Inc.
Curated by ChEMBL
Assay Description
Binding affinity to mineralocorticoid receptor expressed in baculovirus-infected insect cells using tetramethylrhodamine labeled Dexamethasone by flu...
J Med Chem 53: 6681-98 (2010)
Article DOI: 10.1021/jm100751q
BindingDB Entry DOI: 10.7270/Q2571D0X