BDBM50326941 1,1,1-Trifluoro-4-(5-fluoro-2-methoxyphenyl)-4-methyl-2-(6-oxy-1H-pyrrolo[2,3-c]pyridin-2-ylmethyl)pentan-2-ol::CHEMBL1254821
SMILES: COc1ccc(F)cc1C(C)(C)CC(O)(Cc1cc2cc[n+]([O-])cc2[nH]1)C(F)(F)F
InChI Key: InChIKey=YXQHFQSWIAZVFJ-UHFFFAOYSA-N
Data: 3 IC50
Activity Spreadsheet -- Enzyme Inhibition Constant Data from BindingDB
Found 3 hits for monomerid = 50326941
Trg + Lig
Ki
nM
ΔG°
kcal/mole
IC50
nM
Kd
nM
EC50/IC50
nM
koff
s-1
kon
M-1s-1
pHTemp
°C
Glucocorticoid receptor
(Homo sapiens (Human))
BDBM50326941
(1,1,1-Trifluoro-4-(5-fluoro-2-methoxyphenyl)-4-met...)
Show SMILES COc1ccc(F)cc1C(C)(C)CC(O)(Cc1cc2cc[n+]([O-])cc2[nH]1)C(F)(F)F
Show InChI InChI=1S/C21H22F4N2O3/c1-19(2,16-9-14(22)4-5-18(16)30-3)12-20(28,21(23,24)25)10-15-8-13-6-7-27(29)11-17(13)26-15/h4-9,11,26,28H,10,12H2,1-3H3
n/an/a 860n/an/an/an/an/an/a
Boehringer-Ingelheim Pharmaceuticals Inc.
Curated by ChEMBL
Assay Description
Binding affinity to glucocorticoid receptor expressed in baculovirus-infected insect cells using tetramethylrhodamine labeled Dexamethasone by fluore...
J Med Chem 53: 6681-98 (2010)
Article DOI: 10.1021/jm100751q
BindingDB Entry DOI: 10.7270/Q2571D0X
Mineralocorticoid receptor
(Homo sapiens (Human))
BDBM50326941
(1,1,1-Trifluoro-4-(5-fluoro-2-methoxyphenyl)-4-met...)
Show SMILES COc1ccc(F)cc1C(C)(C)CC(O)(Cc1cc2cc[n+]([O-])cc2[nH]1)C(F)(F)F
Show InChI InChI=1S/C21H22F4N2O3/c1-19(2,16-9-14(22)4-5-18(16)30-3)12-20(28,21(23,24)25)10-15-8-13-6-7-27(29)11-17(13)26-15/h4-9,11,26,28H,10,12H2,1-3H3
n/an/a>2.00E+3n/an/an/an/an/an/a
Boehringer-Ingelheim Pharmaceuticals Inc.
Curated by ChEMBL
Assay Description
Binding affinity to mineralocorticoid receptor expressed in baculovirus-infected insect cells using tetramethylrhodamine labeled Dexamethasone by flu...
J Med Chem 53: 6681-98 (2010)
Article DOI: 10.1021/jm100751q
BindingDB Entry DOI: 10.7270/Q2571D0X
Progesterone receptor
(Homo sapiens (Human))
BDBM50326941
(1,1,1-Trifluoro-4-(5-fluoro-2-methoxyphenyl)-4-met...)
Show SMILES COc1ccc(F)cc1C(C)(C)CC(O)(Cc1cc2cc[n+]([O-])cc2[nH]1)C(F)(F)F
Show InChI InChI=1S/C21H22F4N2O3/c1-19(2,16-9-14(22)4-5-18(16)30-3)12-20(28,21(23,24)25)10-15-8-13-6-7-27(29)11-17(13)26-15/h4-9,11,26,28H,10,12H2,1-3H3
n/an/a>2.00E+3n/an/an/an/an/an/a
Boehringer-Ingelheim Pharmaceuticals Inc.
Curated by ChEMBL
Assay Description
Binding affinity to progesterone receptor expressed in baculovirus-infected insect cells using tetramethylrhodamine labeled RU-486 by fluorescence po...
J Med Chem 53: 6681-98 (2010)
Article DOI: 10.1021/jm100751q
BindingDB Entry DOI: 10.7270/Q2571D0X