BDBM50327056 CHEMBL1253915::N-{4-[(5-Methyl-5H-pyrrolo[3,2-d]pyrimidin-4-yl)oxy]-phenyl}-1H-benzimidazol-2-amine
SMILES: Cn1ccc2ncnc(Oc3ccc(Nc4nc5ccccc5[nH]4)cc3)c12
InChI Key: InChIKey=YXAQBFXRVSBMEL-UHFFFAOYSA-N
Data: 1 IC50
PDB links: 1 PDB ID matches this monomer.
Activity Spreadsheet -- Enzyme Inhibition Constant Data from BindingDB
Found 1 hit for monomerid = 50327056
Trg + Lig
Ki
nM
ΔG°
kcal/mole
IC50
nM
Kd
nM
EC50/IC50
nM
koff
s-1
kon
M-1s-1
pHTemp
°C
Vascular endothelial growth factor receptor 2
(Homo sapiens (Human))
BDBM50327056
(CHEMBL1253915 | N-{4-[(5-Methyl-5H-pyrrolo[3,2-d]p...)
Show SMILES Cn1ccc2ncnc(Oc3ccc(Nc4nc5ccccc5[nH]4)cc3)c12
Show InChI InChI=1S/C20H16N6O/c1-26-11-10-17-18(26)19(22-12-21-17)27-14-8-6-13(7-9-14)23-20-24-15-4-2-3-5-16(15)25-20/h2-12H,1H3,(H2,23,24,25)
NCI pathway
Reactome pathway
n/an/a 4.20E+3n/an/an/an/an/an/a
Takeda Pharmaceutical Co., Ltd
Curated by ChEMBL
Assay Description
Inhibition of human VEGFR2
Bioorg Med Chem 18: 7260-73 (2010)
Article DOI: 10.1016/j.bmc.2010.08.017
BindingDB Entry DOI: 10.7270/Q2NC61DC