BDBM50327063 1-(3-Bromophenyl)-3-{4-[(5-methyl-5H-pyrrolo[3,2-d]pyrimidin-4-yl)oxy]phenyl}urea::CHEMBL1254835
SMILES: Cn1ccc2ncnc(Oc3ccc(NC(=O)Nc4cccc(Br)c4)cc3)c12
InChI Key: InChIKey=ILXHDTBTNRIASC-UHFFFAOYSA-N
Data: 1 IC50
Activity Spreadsheet -- Enzyme Inhibition Constant Data from BindingDB
Found 1 hit for monomerid = 50327063
Trg + Lig
Ki
nM
ΔG°
kcal/mole
IC50
nM
Kd
nM
EC50/IC50
nM
koff
s-1
kon
M-1s-1
pHTemp
°C
Vascular endothelial growth factor receptor 2
(Homo sapiens (Human))
BDBM50327063
(1-(3-Bromophenyl)-3-{4-[(5-methyl-5H-pyrrolo[3,2-d...)
Show SMILES Cn1ccc2ncnc(Oc3ccc(NC(=O)Nc4cccc(Br)c4)cc3)c12
Show InChI InChI=1S/C20H16BrN5O2/c1-26-10-9-17-18(26)19(23-12-22-17)28-16-7-5-14(6-8-16)24-20(27)25-15-4-2-3-13(21)11-15/h2-12H,1H3,(H2,24,25,27)
NCI pathway
Reactome pathway
n/an/a 4.40n/an/an/an/an/an/a
Takeda Pharmaceutical Co., Ltd
Curated by ChEMBL
Assay Description
Inhibition of human VEGFR2
Bioorg Med Chem 18: 7260-73 (2010)
Article DOI: 10.1016/j.bmc.2010.08.017
BindingDB Entry DOI: 10.7270/Q2NC61DC