null
SMILES: Cc1ccc(CN2[C@H]3CC[C@@H]2C[C@H](C3)Oc2cccc(c2)C(N)=O)cc1
InChI Key: InChIKey=NBCIMSDAMDKCQO-CEQLMSFQSA-N
Activity Spreadsheet -- Enzyme Inhibition Constant Data from BindingDB
Found 4 hits for monomerid = 50327248
Trg + Lig
Ki
nM
ΔG°
kcal/mole
IC50
nM
Kd
nM
EC50/IC50
nM
koff
s-1
kon
M-1s-1
pHTemp
°C
Delta-type opioid receptor
(Homo sapiens (Human))
BDBM50327248
(CHEMBL1257821 | endo-3-(8-(4-methylbenzyl)-8-azabi...)
Show SMILES Cc1ccc(CN2[C@H]3CC[C@@H]2C[C@H](C3)Oc2cccc(c2)C(N)=O)cc1 |r,TLB:5:6:12.11.13:9.8|
Show InChI InChI=1S/C22H26N2O2/c1-15-5-7-16(8-6-15)14-24-18-9-10-19(24)13-21(12-18)26-20-4-2-3-17(11-20)22(23)25/h2-8,11,18-19,21H,9-10,12-14H2,1H3,(H2,23,25)/t18-,19+,21-
Reactome pathway
n/an/a 1.09E+4n/an/an/an/an/an/a
AstraZeneca Pharmaceuticals
Curated by ChEMBL
Assay Description
Antagonist activity at human delta opioid receptor assessed as inhibition of SNC80-stimulated [35S]GTPgammaS binding
Bioorg Med Chem Lett 20: 5847-52 (2010)
Article DOI: 10.1016/j.bmcl.2010.07.113
BindingDB Entry DOI: 10.7270/Q23F4PV1
Potassium voltage-gated channel subfamily H member 2
(Homo sapiens (Human))
BDBM50327248
(CHEMBL1257821 | endo-3-(8-(4-methylbenzyl)-8-azabi...)
Show SMILES Cc1ccc(CN2[C@H]3CC[C@@H]2C[C@H](C3)Oc2cccc(c2)C(N)=O)cc1 |r,TLB:5:6:12.11.13:9.8|
Show InChI InChI=1S/C22H26N2O2/c1-15-5-7-16(8-6-15)14-24-18-9-10-19(24)13-21(12-18)26-20-4-2-3-17(11-20)22(23)25/h2-8,11,18-19,21H,9-10,12-14H2,1H3,(H2,23,25)/t18-,19+,21-
Reactome pathway
n/an/a 0.140n/an/an/an/an/an/a
AstraZeneca Pharmaceuticals
Curated by ChEMBL
Assay Description
Inhibition of human ERG
Bioorg Med Chem Lett 20: 5847-52 (2010)
Article DOI: 10.1016/j.bmcl.2010.07.113
BindingDB Entry DOI: 10.7270/Q23F4PV1
Kappa-type opioid receptor
(Homo sapiens (Human))
BDBM50327248
(CHEMBL1257821 | endo-3-(8-(4-methylbenzyl)-8-azabi...)
Show SMILES Cc1ccc(CN2[C@H]3CC[C@@H]2C[C@H](C3)Oc2cccc(c2)C(N)=O)cc1 |r,TLB:5:6:12.11.13:9.8|
Show InChI InChI=1S/C22H26N2O2/c1-15-5-7-16(8-6-15)14-24-18-9-10-19(24)13-21(12-18)26-20-4-2-3-17(11-20)22(23)25/h2-8,11,18-19,21H,9-10,12-14H2,1H3,(H2,23,25)/t18-,19+,21-
Reactome pathway
n/an/a 49n/an/an/an/an/an/a
AstraZeneca Pharmaceuticals
Curated by ChEMBL
Assay Description
Antagonist activity at human kappa opioid receptor assessed as inhibition of dynorphin A-induced [35S]GTPgammaS binding
Bioorg Med Chem Lett 20: 5847-52 (2010)
Article DOI: 10.1016/j.bmcl.2010.07.113
BindingDB Entry DOI: 10.7270/Q23F4PV1
Mu-type opioid receptor
(Homo sapiens (Human))
BDBM50327248
(CHEMBL1257821 | endo-3-(8-(4-methylbenzyl)-8-azabi...)
Show SMILES Cc1ccc(CN2[C@H]3CC[C@@H]2C[C@H](C3)Oc2cccc(c2)C(N)=O)cc1 |r,TLB:5:6:12.11.13:9.8|
Show InChI InChI=1S/C22H26N2O2/c1-15-5-7-16(8-6-15)14-24-18-9-10-19(24)13-21(12-18)26-20-4-2-3-17(11-20)22(23)25/h2-8,11,18-19,21H,9-10,12-14H2,1H3,(H2,23,25)/t18-,19+,21-
NCI pathway
Reactome pathway
n/an/a 482n/an/an/an/an/an/a
AstraZeneca Pharmaceuticals
Curated by ChEMBL
Assay Description
Antagonist activity at human mu opioid receptor assessed as inhibition of DAMGO-stimulated [35S]GTPgammaS binding
Bioorg Med Chem Lett 20: 5847-52 (2010)
Article DOI: 10.1016/j.bmcl.2010.07.113
BindingDB Entry DOI: 10.7270/Q23F4PV1