BDBM50327263 CHEMBL1258502::endo-3-(8-(2-oxo-2-(pyrrolidin-1-yl)ethyl)-8-azabicyclo[3.2.1]octan-3-yloxy)benzamide
SMILES: NC(=O)c1cccc(O[C@H]2C[C@@H]3CC[C@H](C2)N3CC(=O)N2CCCC2)c1
InChI Key: InChIKey=GOPNBPAPDSQRFK-ALXJQNPVSA-N
Data: 4 IC50
Activity Spreadsheet -- Enzyme Inhibition Constant Data from BindingDB
Found 4 hits for monomerid = 50327263
Trg + Lig
Ki
nM
ΔG°
kcal/mole
IC50
nM
Kd
nM
EC50/IC50
nM
koff
s-1
kon
M-1s-1
pHTemp
°C
Delta-type opioid receptor
(Homo sapiens (Human))
BDBM50327263
(CHEMBL1258502 | endo-3-(8-(2-oxo-2-(pyrrolidin-1-y...)
Show SMILES NC(=O)c1cccc(O[C@H]2C[C@@H]3CC[C@H](C2)N3CC(=O)N2CCCC2)c1 |r,TLB:17:16:9.15.10:13.12|
Show InChI InChI=1S/C20H27N3O3/c21-20(25)14-4-3-5-17(10-14)26-18-11-15-6-7-16(12-18)23(15)13-19(24)22-8-1-2-9-22/h3-5,10,15-16,18H,1-2,6-9,11-13H2,(H2,21,25)/t15-,16+,18-
Reactome pathway
n/an/a>3.00E+4n/an/an/an/an/an/a
AstraZeneca Pharmaceuticals
Curated by ChEMBL
Assay Description
Antagonist activity at human delta opioid receptor assessed as inhibition of SNC80-stimulated [35S]GTPgammaS binding
Bioorg Med Chem Lett 20: 5847-52 (2010)
Article DOI: 10.1016/j.bmcl.2010.07.113
BindingDB Entry DOI: 10.7270/Q23F4PV1
Mu-type opioid receptor
(Homo sapiens (Human))
BDBM50327263
(CHEMBL1258502 | endo-3-(8-(2-oxo-2-(pyrrolidin-1-y...)
Show SMILES NC(=O)c1cccc(O[C@H]2C[C@@H]3CC[C@H](C2)N3CC(=O)N2CCCC2)c1 |r,TLB:17:16:9.15.10:13.12|
Show InChI InChI=1S/C20H27N3O3/c21-20(25)14-4-3-5-17(10-14)26-18-11-15-6-7-16(12-18)23(15)13-19(24)22-8-1-2-9-22/h3-5,10,15-16,18H,1-2,6-9,11-13H2,(H2,21,25)/t15-,16+,18-
NCI pathway
Reactome pathway
n/an/a 2.11E+4n/an/an/an/an/an/a
AstraZeneca Pharmaceuticals
Curated by ChEMBL
Assay Description
Antagonist activity at human mu opioid receptor assessed as inhibition of DAMGO-stimulated [35S]GTPgammaS binding
Bioorg Med Chem Lett 20: 5847-52 (2010)
Article DOI: 10.1016/j.bmcl.2010.07.113
BindingDB Entry DOI: 10.7270/Q23F4PV1
Potassium voltage-gated channel subfamily H member 2
(Homo sapiens (Human))
BDBM50327263
(CHEMBL1258502 | endo-3-(8-(2-oxo-2-(pyrrolidin-1-y...)
Show SMILES NC(=O)c1cccc(O[C@H]2C[C@@H]3CC[C@H](C2)N3CC(=O)N2CCCC2)c1 |r,TLB:17:16:9.15.10:13.12|
Show InChI InChI=1S/C20H27N3O3/c21-20(25)14-4-3-5-17(10-14)26-18-11-15-6-7-16(12-18)23(15)13-19(24)22-8-1-2-9-22/h3-5,10,15-16,18H,1-2,6-9,11-13H2,(H2,21,25)/t15-,16+,18-
Reactome pathway
n/an/a>33n/an/an/an/an/an/a
AstraZeneca Pharmaceuticals
Curated by ChEMBL
Assay Description
Inhibition of human ERG
Bioorg Med Chem Lett 20: 5847-52 (2010)
Article DOI: 10.1016/j.bmcl.2010.07.113
BindingDB Entry DOI: 10.7270/Q23F4PV1
Kappa-type opioid receptor
(Homo sapiens (Human))
BDBM50327263
(CHEMBL1258502 | endo-3-(8-(2-oxo-2-(pyrrolidin-1-y...)
Show SMILES NC(=O)c1cccc(O[C@H]2C[C@@H]3CC[C@H](C2)N3CC(=O)N2CCCC2)c1 |r,TLB:17:16:9.15.10:13.12|
Show InChI InChI=1S/C20H27N3O3/c21-20(25)14-4-3-5-17(10-14)26-18-11-15-6-7-16(12-18)23(15)13-19(24)22-8-1-2-9-22/h3-5,10,15-16,18H,1-2,6-9,11-13H2,(H2,21,25)/t15-,16+,18-
Reactome pathway
n/an/a 3.41E+3n/an/an/an/an/an/a
AstraZeneca Pharmaceuticals
Curated by ChEMBL
Assay Description
Antagonist activity at human kappa opioid receptor assessed as inhibition of dynorphin A-induced [35S]GTPgammaS binding
Bioorg Med Chem Lett 20: 5847-52 (2010)
Article DOI: 10.1016/j.bmcl.2010.07.113
BindingDB Entry DOI: 10.7270/Q23F4PV1