BDBM50327486 8-(1-isopropylpiperidin-4-yloxy)-2-(pyridin-3-ylmethyl)-3,4-dihydropyrazino[1,2-a]indol-1(2H)-one::CHEMBL1257486
SMILES: CC(C)N1CCC(CC1)Oc1ccc2n3CCN(Cc4cccnc4)C(=O)c3cc2c1
InChI Key: InChIKey=HBRVUVJCCFXDJC-UHFFFAOYSA-N
Data: 1 KI  1 EC50
Activity Spreadsheet -- Enzyme Inhibition Constant Data from BindingDB
Found 2 hits for monomerid = 50327486
Trg + Lig
Ki
nM
ΔG°
kcal/mole
IC50
nM
Kd
nM
EC50/IC50
nM
koff
s-1
kon
M-1s-1
pHTemp
°C
Histamine H3 receptor
(Homo sapiens (Human))
BDBM50327486
(8-(1-isopropylpiperidin-4-yloxy)-2-(pyridin-3-ylme...)
Show SMILES CC(C)N1CCC(CC1)Oc1ccc2n3CCN(Cc4cccnc4)C(=O)c3cc2c1
Show InChI InChI=1S/C25H30N4O2/c1-18(2)27-10-7-21(8-11-27)31-22-5-6-23-20(14-22)15-24-25(30)28(12-13-29(23)24)17-19-4-3-9-26-16-19/h3-6,9,14-16,18,21H,7-8,10-13,17H2,1-2H3
Reactome pathway
5n/an/an/an/an/an/an/an/a
F Hoffmann-La Roche Ltd
Curated by ChEMBL
Assay Description
Displacement of [3H]-RAMH from human histamine H3 receptor
Bioorg Med Chem Lett 20: 5713-7 (2010)
Article DOI: 10.1016/j.bmcl.2010.08.009
BindingDB Entry DOI: 10.7270/Q2571C7N
Histamine H3 receptor
(Homo sapiens (Human))
BDBM50327486
(8-(1-isopropylpiperidin-4-yloxy)-2-(pyridin-3-ylme...)
Show SMILES CC(C)N1CCC(CC1)Oc1ccc2n3CCN(Cc4cccnc4)C(=O)c3cc2c1
Show InChI InChI=1S/C25H30N4O2/c1-18(2)27-10-7-21(8-11-27)31-22-5-6-23-20(14-22)15-24-25(30)28(12-13-29(23)24)17-19-4-3-9-26-16-19/h3-6,9,14-16,18,21H,7-8,10-13,17H2,1-2H3
Reactome pathway
n/an/an/an/a 13n/an/an/an/a
F Hoffmann-La Roche Ltd
Curated by ChEMBL
Assay Description
Inverse agonist activity at human recombinant histamine H3 receptor assessed as effect on [35S]GTPgammaS binding
Bioorg Med Chem Lett 20: 5713-7 (2010)
Article DOI: 10.1016/j.bmcl.2010.08.009
BindingDB Entry DOI: 10.7270/Q2571C7N