BDBM50327903 CHEMBL1258910::trans-2-amino-8-(4-(2-hydroxyethoxy)cyclohexyl)-4-methyl-6-(6-methylpyridin-3-yl)pteridin-7(8H)-one
SMILES: Cc1ccc(cn1)-c1nc2c(C)nc(N)nc2n([C@H]2CC[C@@H](CC2)OCCO)c1=O
InChI Key: InChIKey=FDYCDLMAMJYKQV-WKILWMFISA-N
Data: 1 KI  1 IC50
Activity Spreadsheet -- Enzyme Inhibition Constant Data from BindingDB
Found 2 hits for monomerid = 50327903
Trg + Lig
Ki
nM
ΔG°
kcal/mole
IC50
nM
Kd
nM
EC50/IC50
nM
koff
s-1
kon
M-1s-1
pHTemp
°C
Serine/threonine-protein kinase mTOR
(Homo sapiens (Human))
BDBM50327903
(CHEMBL1258910 | trans-2-amino-8-(4-(2-hydroxyethox...)
Show SMILES Cc1ccc(cn1)-c1nc2c(C)nc(N)nc2n([C@H]2CC[C@@H](CC2)OCCO)c1=O |r,wU:18.19,wD:21.26,(6.04,1.56,;4.72,.78,;4.73,-.76,;3.4,-1.53,;2.06,-.77,;2.05,.76,;3.37,1.55,;.74,-1.54,;-.6,-.78,;-1.93,-1.56,;-3.26,-.79,;-3.27,.75,;-4.59,-1.56,;-4.59,-3.11,;-5.93,-3.88,;-3.26,-3.88,;-1.93,-3.1,;-.59,-3.87,;-.59,-5.41,;.75,-6.17,;.75,-7.72,;-.59,-8.49,;-1.92,-7.71,;-1.92,-6.18,;-.59,-10.03,;-1.93,-10.8,;-1.93,-12.34,;-3.26,-13.1,;.74,-3.09,;2.08,-3.86,)|
Show InChI InChI=1S/C21H26N6O3/c1-12-3-4-14(11-23-12)18-20(29)27(15-5-7-16(8-6-15)30-10-9-28)19-17(25-18)13(2)24-21(22)26-19/h3-4,11,15-16,28H,5-10H2,1-2H3,(H2,22,24,26)/t15-,16-
NCI pathway
Reactome pathway
5.11n/an/an/an/an/an/an/an/a
Pfizer Inc.
Curated by ChEMBL
Assay Description
Inhibition of mTOR
Bioorg Med Chem Lett 20: 6096-9 (2010)
Article DOI: 10.1016/j.bmcl.2010.08.045
BindingDB Entry DOI: 10.7270/Q2ZK5GWH
RAC-alpha serine/threonine-protein kinase
(Homo sapiens (Human))
BDBM50327903
(CHEMBL1258910 | trans-2-amino-8-(4-(2-hydroxyethox...)
Show SMILES Cc1ccc(cn1)-c1nc2c(C)nc(N)nc2n([C@H]2CC[C@@H](CC2)OCCO)c1=O |r,wU:18.19,wD:21.26,(6.04,1.56,;4.72,.78,;4.73,-.76,;3.4,-1.53,;2.06,-.77,;2.05,.76,;3.37,1.55,;.74,-1.54,;-.6,-.78,;-1.93,-1.56,;-3.26,-.79,;-3.27,.75,;-4.59,-1.56,;-4.59,-3.11,;-5.93,-3.88,;-3.26,-3.88,;-1.93,-3.1,;-.59,-3.87,;-.59,-5.41,;.75,-6.17,;.75,-7.72,;-.59,-8.49,;-1.92,-7.71,;-1.92,-6.18,;-.59,-10.03,;-1.93,-10.8,;-1.93,-12.34,;-3.26,-13.1,;.74,-3.09,;2.08,-3.86,)|
Show InChI InChI=1S/C21H26N6O3/c1-12-3-4-14(11-23-12)18-20(29)27(15-5-7-16(8-6-15)30-10-9-28)19-17(25-18)13(2)24-21(22)26-19/h3-4,11,15-16,28H,5-10H2,1-2H3,(H2,22,24,26)/t15-,16-
n/an/a 5.74n/an/an/an/an/an/a
Pfizer Inc.
Curated by ChEMBL
Assay Description
Inhibition of AKT in human BT20 cells assessed as inhibition of S473 phosphorylation
Bioorg Med Chem Lett 20: 6096-9 (2010)
Article DOI: 10.1016/j.bmcl.2010.08.045
BindingDB Entry DOI: 10.7270/Q2ZK5GWH