BDBM50327905 CHEMBL1257177::trans-2-amino-8-((1r,4r)-4-hydroxycyclohexyl)-6-(6-methoxypyridin-3-yl)-4-methylpteridin-7(8H)-one
SMILES: COc1ccc(cn1)-c1nc2c(C)nc(N)nc2n([C@H]2CC[C@H](O)CC2)c1=O
InChI Key: InChIKey=FICWXAPOGIEJJR-JOCQHMNTSA-N
Data: 1 KI  1 IC50
Activity Spreadsheet -- Enzyme Inhibition Constant Data from BindingDB
Found 2 hits for monomerid = 50327905
Trg + Lig
Ki
nM
ΔG°
kcal/mole
IC50
nM
Kd
nM
EC50/IC50
nM
koff
s-1
kon
M-1s-1
pHTemp
°C
Serine/threonine-protein kinase mTOR
(Homo sapiens (Human))
BDBM50327905
(CHEMBL1257177 | trans-2-amino-8-((1r,4r)-4-hydroxy...)
Show SMILES COc1ccc(cn1)-c1nc2c(C)nc(N)nc2n([C@H]2CC[C@H](O)CC2)c1=O |r,wU:19.20,wD:22.24,(6.1,-15.1,;4.76,-14.34,;3.43,-15.12,;3.44,-16.66,;2.11,-17.44,;.77,-16.67,;.76,-15.14,;2.09,-14.36,;-.55,-17.45,;-1.88,-16.69,;-3.21,-17.46,;-4.55,-16.7,;-4.55,-15.16,;-5.87,-17.47,;-5.88,-19.01,;-7.21,-19.78,;-4.54,-19.78,;-3.21,-19,;-1.87,-19.77,;-1.87,-21.31,;-.53,-22.08,;-.54,-23.62,;-1.87,-24.39,;-1.87,-25.93,;-3.2,-23.62,;-3.2,-22.08,;-.54,-19,;.8,-19.76,)|
Show InChI InChI=1S/C19H22N6O3/c1-10-15-17(24-19(20)22-10)25(12-4-6-13(26)7-5-12)18(27)16(23-15)11-3-8-14(28-2)21-9-11/h3,8-9,12-13,26H,4-7H2,1-2H3,(H2,20,22,24)/t12-,13-
NCI pathway
Reactome pathway
6.80n/an/an/an/an/an/an/an/a
Pfizer Inc.
Curated by ChEMBL
Assay Description
Inhibition of mTOR
Bioorg Med Chem Lett 20: 6096-9 (2010)
Article DOI: 10.1016/j.bmcl.2010.08.045
BindingDB Entry DOI: 10.7270/Q2ZK5GWH
RAC-alpha serine/threonine-protein kinase
(Homo sapiens (Human))
BDBM50327905
(CHEMBL1257177 | trans-2-amino-8-((1r,4r)-4-hydroxy...)
Show SMILES COc1ccc(cn1)-c1nc2c(C)nc(N)nc2n([C@H]2CC[C@H](O)CC2)c1=O |r,wU:19.20,wD:22.24,(6.1,-15.1,;4.76,-14.34,;3.43,-15.12,;3.44,-16.66,;2.11,-17.44,;.77,-16.67,;.76,-15.14,;2.09,-14.36,;-.55,-17.45,;-1.88,-16.69,;-3.21,-17.46,;-4.55,-16.7,;-4.55,-15.16,;-5.87,-17.47,;-5.88,-19.01,;-7.21,-19.78,;-4.54,-19.78,;-3.21,-19,;-1.87,-19.77,;-1.87,-21.31,;-.53,-22.08,;-.54,-23.62,;-1.87,-24.39,;-1.87,-25.93,;-3.2,-23.62,;-3.2,-22.08,;-.54,-19,;.8,-19.76,)|
Show InChI InChI=1S/C19H22N6O3/c1-10-15-17(24-19(20)22-10)25(12-4-6-13(26)7-5-12)18(27)16(23-15)11-3-8-14(28-2)21-9-11/h3,8-9,12-13,26H,4-7H2,1-2H3,(H2,20,22,24)/t12-,13-
n/an/a 14.3n/an/an/an/an/an/a
Pfizer Inc.
Curated by ChEMBL
Assay Description
Inhibition of AKT in human BT20 cells assessed as inhibition of S473 phosphorylation
Bioorg Med Chem Lett 20: 6096-9 (2010)
Article DOI: 10.1016/j.bmcl.2010.08.045
BindingDB Entry DOI: 10.7270/Q2ZK5GWH