BDBM50327906 2-amino-4-methyl-6-(6-methylpyridin-3-yl)-8-(tetrahydro-2H-pyran-4-yl)pteridin-7(8H)-one::CHEMBL1257178
SMILES: Cc1ccc(cn1)-c1nc2c(C)nc(N)nc2n(C2CCOCC2)c1=O
InChI Key: InChIKey=HGBAUBFPJYKLQG-UHFFFAOYSA-N
Data: 1 KI  1 IC50
Activity Spreadsheet -- Enzyme Inhibition Constant Data from BindingDB
Found 2 hits for monomerid = 50327906
Trg + Lig
Ki
nM
ΔG°
kcal/mole
IC50
nM
Kd
nM
EC50/IC50
nM
koff
s-1
kon
M-1s-1
pHTemp
°C
Serine/threonine-protein kinase mTOR
(Homo sapiens (Human))
BDBM50327906
(2-amino-4-methyl-6-(6-methylpyridin-3-yl)-8-(tetra...)
Show SMILES Cc1ccc(cn1)-c1nc2c(C)nc(N)nc2n(C2CCOCC2)c1=O
Show InChI InChI=1S/C18H20N6O2/c1-10-3-4-12(9-20-10)15-17(25)24(13-5-7-26-8-6-13)16-14(22-15)11(2)21-18(19)23-16/h3-4,9,13H,5-8H2,1-2H3,(H2,19,21,23)
NCI pathway
Reactome pathway
5n/an/an/an/an/an/an/an/a
Pfizer Inc.
Curated by ChEMBL
Assay Description
Inhibition of mTOR
Bioorg Med Chem Lett 20: 6096-9 (2010)
Article DOI: 10.1016/j.bmcl.2010.08.045
BindingDB Entry DOI: 10.7270/Q2ZK5GWH
RAC-alpha serine/threonine-protein kinase
(Homo sapiens (Human))
BDBM50327906
(2-amino-4-methyl-6-(6-methylpyridin-3-yl)-8-(tetra...)
Show SMILES Cc1ccc(cn1)-c1nc2c(C)nc(N)nc2n(C2CCOCC2)c1=O
Show InChI InChI=1S/C18H20N6O2/c1-10-3-4-12(9-20-10)15-17(25)24(13-5-7-26-8-6-13)16-14(22-15)11(2)21-18(19)23-16/h3-4,9,13H,5-8H2,1-2H3,(H2,19,21,23)
n/an/a 25n/an/an/an/an/an/a
Pfizer Inc.
Curated by ChEMBL
Assay Description
Inhibition of AKT in human BT20 cells assessed as inhibition of S473 phosphorylation
Bioorg Med Chem Lett 20: 6096-9 (2010)
Article DOI: 10.1016/j.bmcl.2010.08.045
BindingDB Entry DOI: 10.7270/Q2ZK5GWH