BDBM50327908 3,4,5,3'-tetrahydroxybenzophenone::CHEMBL1256379
SMILES: Oc1cccc(c1)C(=O)c1cc(O)c(O)c(O)c1
InChI Key: InChIKey=BGRHXPHEMQYXJP-UHFFFAOYSA-N
Data: 1 IC50
Activity Spreadsheet -- Enzyme Inhibition Constant Data from BindingDB
Found 1 hit for monomerid = 50327908
Trg + Lig
Ki
nM
ΔG°
kcal/mole
IC50
nM
Kd
nM
EC50/IC50
nM
koff
s-1
kon
M-1s-1
pHTemp
°C
Fatty acid synthase
(Homo sapiens (Human))
BDBM50327908
(3,4,5,3'-tetrahydroxybenzophenone | CHEMBL1256379)
Show SMILES Oc1cccc(c1)C(=O)c1cc(O)c(O)c(O)c1
Show InChI InChI=1S/C13H10O5/c14-9-3-1-2-7(4-9)12(17)8-5-10(15)13(18)11(16)6-8/h1-6,14-16,18H
n/an/a 1.48E+4n/an/an/an/an/an/a
Chinese Academy of Sciences
Curated by ChEMBL
Assay Description
Inhibition of FAS
Bioorg Med Chem Lett 20: 6045-7 (2010)
Article DOI: 10.1016/j.bmcl.2010.08.061
BindingDB Entry DOI: 10.7270/Q2TT4R6N