BDBM50327926 3-[4-(4-Methyl-piperazin-1-yl)-benzoylamino]-1H-thieno[3,2-c]pyrazole-5-carboxylic acid((S)-2-morpholin-4-yl-1-phenyl-ethyl)-amide::CHEMBL1258793
SMILES: CN1CCN(CC1)c1ccc(cc1)C(=O)Nc1[nH]nc2cc(sc12)C(=O)N[C@H](CN1CCOCC1)c1ccccc1
InChI Key: InChIKey=APULUFKDCXQRIE-RUZDIDTESA-N
Data: 1 IC50
Activity Spreadsheet -- Enzyme Inhibition Constant Data from BindingDB
Found 1 hit for monomerid = 50327926
Trg + Lig
Ki
nM
ΔG°
kcal/mole
IC50
nM
Kd
nM
EC50/IC50
nM
koff
s-1
kon
M-1s-1
pHTemp
°C
Aurora kinase A
(Homo sapiens (Human))
BDBM50327926
(3-[4-(4-Methyl-piperazin-1-yl)-benzoylamino]-1H-th...)
Show SMILES CN1CCN(CC1)c1ccc(cc1)C(=O)Nc1[nH]nc2cc(sc12)C(=O)N[C@H](CN1CCOCC1)c1ccccc1 |r|
Show InChI InChI=1S/C30H35N7O3S/c1-35-11-13-37(14-12-35)23-9-7-22(8-10-23)29(38)32-28-27-24(33-34-28)19-26(41-27)30(39)31-25(21-5-3-2-4-6-21)20-36-15-17-40-18-16-36/h2-10,19,25H,11-18,20H2,1H3,(H,31,39)(H2,32,33,34,38)/t25-/m1/s1
NCI pathway
Reactome pathway
n/an/a 18n/an/an/an/an/an/a
Nerviano Medical Sciences-Oncology
Curated by ChEMBL
Assay Description
Inhibition of AurA
Bioorg Med Chem 18: 7113-20 (2010)
Article DOI: 10.1016/j.bmc.2010.07.048
BindingDB Entry DOI: 10.7270/Q2Q240GM