BDBM50328147 6-(pyridin-4-yl)-N-(4-(trifluoromethoxy)phenyl)pyrimidin-4-amine::CHEMBL1258924
SMILES: FC(F)(F)Oc1ccc(Nc2cc(ncn2)-c2ccncc2)cc1
InChI Key: InChIKey=QTSVCLAUIGSDSU-UHFFFAOYSA-N
Data: 1 EC50
Activity Spreadsheet -- Enzyme Inhibition Constant Data from BindingDB
Found 1 hit for monomerid = 50328147
Trg + Lig
Ki
nM
ΔG°
kcal/mole
IC50
nM
Kd
nM
EC50/IC50
nM
koff
s-1
kon
M-1s-1
pHTemp
°C
Bcr-Abl
(Homo sapiens (Human))
BDBM50328147
(6-(pyridin-4-yl)-N-(4-(trifluoromethoxy)phenyl)pyr...)
Show SMILES FC(F)(F)Oc1ccc(Nc2cc(ncn2)-c2ccncc2)cc1
Show InChI InChI=1S/C16H11F3N4O/c17-16(18,19)24-13-3-1-12(2-4-13)23-15-9-14(21-10-22-15)11-5-7-20-8-6-11/h1-10H,(H,21,22,23)
NCI pathway
Reactome pathway
n/an/an/an/a 470n/an/an/an/a
Harvard Medical School
Curated by ChEMBL
Assay Description
Inhibition of Bcr-Abl in mouse BA/F3 cells
J Med Chem 53: 6934-46 (2010)
Article DOI: 10.1021/jm100555f
BindingDB Entry DOI: 10.7270/Q2DJ5FTW