BDBM50328156 6-(1-isobutyl-1H-pyrazol-4-yl)-N-(4-(trifluoromethoxy)phenyl)pyrimidin-4-amine::CHEMBL1257658::US9670214, TABLE 16.45
SMILES: CC(C)Cn1cc(cn1)-c1cc(Nc2ccc(OC(F)(F)F)cc2)ncn1
InChI Key: InChIKey=VRLVMMQZIBLEME-UHFFFAOYSA-N
Data: 2 IC50  1 EC50
Activity Spreadsheet -- Enzyme Inhibition Constant Data from BindingDB
Found 3 hits for monomerid = 50328156
Trg + Lig
Ki
nM
ΔG°
kcal/mole
IC50
nM
Kd
nM
EC50/IC50
nM
koff
s-1
kon
M-1s-1
pHTemp
°C
Bcr-Abl
(Homo sapiens (Human))
BDBM50328156
(6-(1-isobutyl-1H-pyrazol-4-yl)-N-(4-(trifluorometh...)
Show SMILES CC(C)Cn1cc(cn1)-c1cc(Nc2ccc(OC(F)(F)F)cc2)ncn1
Show InChI InChI=1S/C18H18F3N5O/c1-12(2)9-26-10-13(8-24-26)16-7-17(23-11-22-16)25-14-3-5-15(6-4-14)27-18(19,20)21/h3-8,10-12H,9H2,1-2H3,(H,22,23,25)
NCI pathway
Reactome pathway
n/an/an/an/a 360n/an/an/an/a
Harvard Medical School
Curated by ChEMBL
Assay Description
Inhibition of Bcr-Abl in mouse BA/F3 cells
J Med Chem 53: 6934-46 (2010)
Article DOI: 10.1021/jm100555f
BindingDB Entry DOI: 10.7270/Q2DJ5FTW
BCR/ABL fusion protein (T351I)
(Homo sapiens (Human))
BDBM50328156
(6-(1-isobutyl-1H-pyrazol-4-yl)-N-(4-(trifluorometh...)
Show SMILES CC(C)Cn1cc(cn1)-c1cc(Nc2ccc(OC(F)(F)F)cc2)ncn1
Show InChI InChI=1S/C18H18F3N5O/c1-12(2)9-26-10-13(8-24-26)16-7-17(23-11-22-16)25-14-3-5-15(6-4-14)27-18(19,20)21/h3-8,10-12H,9H2,1-2H3,(H,22,23,25)
US Patent
n/an/a 1.55E+3n/an/an/an/a7.5n/a
DANA-FARBER CANCER INSTITUTE, INC.; THE SCRIPPS RESEARCH INSTITUTE
US Patent
Assay Description
In vitro kinase assays were carried out by using recombinant murine c-abl containing SH3, SH2 and kinase domains (residues 46-531) and full length im...
US Patent US9670214 (2017)
BindingDB Entry DOI: 10.7270/Q2000086
BCR/ABL fusion protein isoform X3
(Homo sapiens (Human))
BDBM50328156
(6-(1-isobutyl-1H-pyrazol-4-yl)-N-(4-(trifluorometh...)
Show SMILES CC(C)Cn1cc(cn1)-c1cc(Nc2ccc(OC(F)(F)F)cc2)ncn1
Show InChI InChI=1S/C18H18F3N5O/c1-12(2)9-26-10-13(8-24-26)16-7-17(23-11-22-16)25-14-3-5-15(6-4-14)27-18(19,20)21/h3-8,10-12H,9H2,1-2H3,(H,22,23,25)
US Patent
n/an/a 360n/an/an/an/a7.5n/a
DANA-FARBER CANCER INSTITUTE, INC.; THE SCRIPPS RESEARCH INSTITUTE
US Patent
Assay Description
In vitro kinase assays were carried out by using recombinant murine c-abl containing SH3, SH2 and kinase domains (residues 46-531) and full length im...
US Patent US9670214 (2017)
BindingDB Entry DOI: 10.7270/Q2000086