BDBM50328158 CHEMBL1257780::N-(4-(trifluoromethoxy)phenyl)-6-(1,3,5-trimethyl-1H-pyrazol-4-yl)pyrimidin-4-amine::US9670214, TABLE 16.47
SMILES: Cc1nn(C)c(C)c1-c1cc(Nc2ccc(OC(F)(F)F)cc2)ncn1
InChI Key: InChIKey=IMJXOERPCNYXHG-UHFFFAOYSA-N
Data: 2 IC50  1 EC50
Activity Spreadsheet -- Enzyme Inhibition Constant Data from BindingDB
Found 3 hits for monomerid = 50328158
Trg + Lig
Ki
nM
ΔG°
kcal/mole
IC50
nM
Kd
nM
EC50/IC50
nM
koff
s-1
kon
M-1s-1
pHTemp
°C
Bcr-Abl
(Homo sapiens (Human))
BDBM50328158
(CHEMBL1257780 | N-(4-(trifluoromethoxy)phenyl)-6-(...)
Show SMILES Cc1nn(C)c(C)c1-c1cc(Nc2ccc(OC(F)(F)F)cc2)ncn1
Show InChI InChI=1S/C17H16F3N5O/c1-10-16(11(2)25(3)24-10)14-8-15(22-9-21-14)23-12-4-6-13(7-5-12)26-17(18,19)20/h4-9H,1-3H3,(H,21,22,23)
NCI pathway
Reactome pathway
n/an/an/an/a 150n/an/an/an/a
Harvard Medical School
Curated by ChEMBL
Assay Description
Inhibition of Bcr-Abl in mouse BA/F3 cells
J Med Chem 53: 6934-46 (2010)
Article DOI: 10.1021/jm100555f
BindingDB Entry DOI: 10.7270/Q2DJ5FTW
BCR/ABL fusion protein (T351I)
(Homo sapiens (Human))
BDBM50328158
(CHEMBL1257780 | N-(4-(trifluoromethoxy)phenyl)-6-(...)
Show SMILES Cc1nn(C)c(C)c1-c1cc(Nc2ccc(OC(F)(F)F)cc2)ncn1
Show InChI InChI=1S/C17H16F3N5O/c1-10-16(11(2)25(3)24-10)14-8-15(22-9-21-14)23-12-4-6-13(7-5-12)26-17(18,19)20/h4-9H,1-3H3,(H,21,22,23)
US Patent
n/an/a>1.00E+4n/an/an/an/a7.5n/a
DANA-FARBER CANCER INSTITUTE, INC.; THE SCRIPPS RESEARCH INSTITUTE
US Patent
Assay Description
In vitro kinase assays were carried out by using recombinant murine c-abl containing SH3, SH2 and kinase domains (residues 46-531) and full length im...
US Patent US9670214 (2017)
BindingDB Entry DOI: 10.7270/Q2000086
BCR/ABL fusion protein isoform X3
(Homo sapiens (Human))
BDBM50328158
(CHEMBL1257780 | N-(4-(trifluoromethoxy)phenyl)-6-(...)
Show SMILES Cc1nn(C)c(C)c1-c1cc(Nc2ccc(OC(F)(F)F)cc2)ncn1
Show InChI InChI=1S/C17H16F3N5O/c1-10-16(11(2)25(3)24-10)14-8-15(22-9-21-14)23-12-4-6-13(7-5-12)26-17(18,19)20/h4-9H,1-3H3,(H,21,22,23)
US Patent
n/an/a 150n/an/an/an/a7.5n/a
DANA-FARBER CANCER INSTITUTE, INC.; THE SCRIPPS RESEARCH INSTITUTE
US Patent
Assay Description
In vitro kinase assays were carried out by using recombinant murine c-abl containing SH3, SH2 and kinase domains (residues 46-531) and full length im...
US Patent US9670214 (2017)
BindingDB Entry DOI: 10.7270/Q2000086