BDBM50328222 3-(4-(5-(1,1,1,3,3,3-hexafluoro-2-hydroxypropan-2-yl)thiazol-2-yl)piperazin-1-yl)benzoic acid::CHEMBL1258699
SMILES: OC(=O)c1cccc(c1)N1CCN(CC1)c1ncc(s1)C(O)(C(F)(F)F)C(F)(F)F
InChI Key: InChIKey=IGXYNXLDPYRZLG-UHFFFAOYSA-N
Data: 1 IC50
Activity Spreadsheet -- Enzyme Inhibition Constant Data from BindingDB
Found 1 hit for monomerid = 50328222
Trg + Lig
Ki
nM
ΔG°
kcal/mole
IC50
nM
Kd
nM
EC50/IC50
nM
koff
s-1
kon
M-1s-1
pHTemp
°C
Malonyl-CoA decarboxylase
(Homo sapiens (Human))
BDBM50328222
(3-(4-(5-(1,1,1,3,3,3-hexafluoro-2-hydroxypropan-2-...)
Show SMILES OC(=O)c1cccc(c1)N1CCN(CC1)c1ncc(s1)C(O)(C(F)(F)F)C(F)(F)F
Show InChI InChI=1S/C17H15F6N3O3S/c18-16(19,20)15(29,17(21,22)23)12-9-24-14(30-12)26-6-4-25(5-7-26)11-3-1-2-10(8-11)13(27)28/h1-3,8-9,29H,4-7H2,(H,27,28)
Reactome pathway
n/an/a 1.30n/an/an/an/an/an/a
Merck Research Laboratories
Curated by ChEMBL
Assay Description
Inhibition of human MCD
Bioorg Med Chem Lett 20: 6088-92 (2010)
Article DOI: 10.1016/j.bmcl.2010.08.047
BindingDB Entry DOI: 10.7270/Q2542NTX