BDBM50328235 3-(1-(5-(1,1,1,3,3,3-hexafluoro-2-hydroxypropan-2-yl)thiazol-2-yl)piperidin-4-yl)benzoic acid::CHEMBL1257549
SMILES: OC(=O)c1cccc(c1)C1CCN(CC1)c1ncc(s1)C(O)(C(F)(F)F)C(F)(F)F
InChI Key: InChIKey=FUYINQOANMAHTB-UHFFFAOYSA-N
Data: 1 IC50  1 EC50
Activity Spreadsheet -- Enzyme Inhibition Constant Data from BindingDB
Found 2 hits for monomerid = 50328235
Trg + Lig
Ki
nM
ΔG°
kcal/mole
IC50
nM
Kd
nM
EC50/IC50
nM
koff
s-1
kon
M-1s-1
pHTemp
°C
Malonyl-CoA decarboxylase, mitochondrial
(Mus musculus)
BDBM50328235
(3-(1-(5-(1,1,1,3,3,3-hexafluoro-2-hydroxypropan-2-...)
Show SMILES OC(=O)c1cccc(c1)C1CCN(CC1)c1ncc(s1)C(O)(C(F)(F)F)C(F)(F)F
Show InChI InChI=1S/C18H16F6N2O3S/c19-17(20,21)16(29,18(22,23)24)13-9-25-15(30-13)26-6-4-10(5-7-26)11-2-1-3-12(8-11)14(27)28/h1-3,8-10,29H,4-7H2,(H,27,28)
Reactome pathway
n/an/an/an/a 230n/an/an/an/a
Merck Research Laboratories
Curated by ChEMBL
Assay Description
Inhibition of MCD in mouse hepatocytes by whole cell assay
Bioorg Med Chem Lett 20: 6088-92 (2010)
Article DOI: 10.1016/j.bmcl.2010.08.047
BindingDB Entry DOI: 10.7270/Q2542NTX
Malonyl-CoA decarboxylase
(Homo sapiens (Human))
BDBM50328235
(3-(1-(5-(1,1,1,3,3,3-hexafluoro-2-hydroxypropan-2-...)
Show SMILES OC(=O)c1cccc(c1)C1CCN(CC1)c1ncc(s1)C(O)(C(F)(F)F)C(F)(F)F
Show InChI InChI=1S/C18H16F6N2O3S/c19-17(20,21)16(29,18(22,23)24)13-9-25-15(30-13)26-6-4-10(5-7-26)11-2-1-3-12(8-11)14(27)28/h1-3,8-10,29H,4-7H2,(H,27,28)
Reactome pathway
n/an/a 0.900n/an/an/an/an/an/a
Merck Research Laboratories
Curated by ChEMBL
Assay Description
Inhibition of human MCD
Bioorg Med Chem Lett 20: 6088-92 (2010)
Article DOI: 10.1016/j.bmcl.2010.08.047
BindingDB Entry DOI: 10.7270/Q2542NTX