BDBM50328261 (5-(2-chlorophenyl)-7-nitro-2,10-dihydrobenzo[e]pyrazolo[4,3-b][1,4]diazepin-3-yl)methanol::CHEMBL1258937
SMILES: OCc1n[nH]c2Nc3ccc(cc3C(=Nc12)c1ccccc1Cl)[N+]([O-])=O
InChI Key: InChIKey=GXLFFMIVIQILFQ-UHFFFAOYSA-N
Data: 1 IC50
Activity Spreadsheet -- Enzyme Inhibition Constant Data from BindingDB
Found 1 hit for monomerid = 50328261
Trg + Lig
Ki
nM
ΔG°
kcal/mole
IC50
nM
Kd
nM
EC50/IC50
nM
koff
s-1
kon
M-1s-1
pHTemp
°C
CDK2/Cyclin E/G1/S-specific cyclin E2
(Homo sapiens (Human))
BDBM50328261
((5-(2-chlorophenyl)-7-nitro-2,10-dihydrobenzo[e]py...)
Show SMILES OCc1n[nH]c2Nc3ccc(cc3C(=Nc12)c1ccccc1Cl)[N+]([O-])=O |c:14|
Show InChI InChI=1S/C17H12ClN5O3/c18-12-4-2-1-3-10(12)15-11-7-9(23(25)26)5-6-13(11)19-17-16(20-15)14(8-24)21-22-17/h1-7,24H,8H2,(H2,19,21,22)
n/an/a 238n/an/an/an/an/an/a
Hoffmann-La Roche Inc.
Curated by ChEMBL
Assay Description
Inhibition of CDK2-cyclin E
Bioorg Med Chem Lett 20: 5984-7 (2010)
Article DOI: 10.1016/j.bmcl.2010.08.079
BindingDB Entry DOI: 10.7270/Q21C1X42