BDBM50328416 (Z)-3-((4-(3-(dimethylamino)propoxy)-3-methylazulen-1-yl)methylene)-4,5-difluoroindolin-2-one::CHEMBL1258711
SMILES: CN(C)CCCOc1ccccc2c(\C=C3/C(=O)Nc4ccc(F)c(F)c34)cc(C)c12
InChI Key: InChIKey=NDOIBVRCWMXUFW-JXAWBTAJSA-N
Data: 1 IC50
Activity Spreadsheet -- Enzyme Inhibition Constant Data from BindingDB
Found 1 hit for monomerid = 50328416
Trg + Lig
Ki
nM
ΔG°
kcal/mole
IC50
nM
Kd
nM
EC50/IC50
nM
koff
s-1
kon
M-1s-1
pHTemp
°C
Receptor-type tyrosine-protein kinase FLT3
(Homo sapiens (Human))
BDBM50328416
((Z)-3-((4-(3-(dimethylamino)propoxy)-3-methylazule...)
Show SMILES CN(C)CCCOc1ccccc2c(\C=C3/C(=O)Nc4ccc(F)c(F)c34)cc(C)c12
Show InChI InChI=1S/C25H24F2N2O2/c1-15-13-16(14-18-23-20(28-25(18)30)10-9-19(26)24(23)27)17-7-4-5-8-21(22(15)17)31-12-6-11-29(2)3/h4-5,7-10,13-14H,6,11-12H2,1-3H3,(H,28,30)/b18-14-
n/an/a 5n/an/an/an/an/an/a
Industrial Technology Research Institute
Curated by ChEMBL
Assay Description
Inhibition of FLT3 by time resolved fluorescence method
Bioorg Med Chem Lett 20: 6129-32 (2010)
Article DOI: 10.1016/j.bmcl.2010.08.025
BindingDB Entry DOI: 10.7270/Q2N29X51