BDBM50328429 1-(3-(8-(4-methoxyphenylamino)imidazo[1,2-a]pyrazin-6-yl)phenyl)-3-phenylurea::CHEMBL1258266
SMILES: COc1ccc(Nc2nc(cn3ccnc23)-c2cccc(NC(=O)Nc3ccccc3)c2)cc1
InChI Key: InChIKey=KKAQOMPTPLEXNA-UHFFFAOYSA-N
Data: 1 IC50
Activity Spreadsheet -- Enzyme Inhibition Constant Data from BindingDB
Found 1 hit for monomerid = 50328429
Trg + Lig
Ki
nM
ΔG°
kcal/mole
IC50
nM
Kd
nM
EC50/IC50
nM
koff
s-1
kon
M-1s-1
pHTemp
°C
Aurora kinase A
(Homo sapiens (Human))
BDBM50328429
(1-(3-(8-(4-methoxyphenylamino)imidazo[1,2-a]pyrazi...)
Show SMILES COc1ccc(Nc2nc(cn3ccnc23)-c2cccc(NC(=O)Nc3ccccc3)c2)cc1
Show InChI InChI=1S/C26H22N6O2/c1-34-22-12-10-20(11-13-22)28-24-25-27-14-15-32(25)17-23(31-24)18-6-5-9-21(16-18)30-26(33)29-19-7-3-2-4-8-19/h2-17H,1H3,(H,28,31)(H2,29,30,33)
NCI pathway
Reactome pathway
n/an/a 7.20E+3n/an/an/an/an/an/a
Institute of Cancer Research
Curated by ChEMBL
Assay Description
Inhibition of human aurora A
Bioorg Med Chem Lett 20: 5988-93 (2010)
Article DOI: 10.1016/j.bmcl.2010.08.091
BindingDB Entry DOI: 10.7270/Q2H995D7