BDBM50328762 1-(3-tert-butyl-1-(3-(2-morpholino-2-oxoethyl)phenyl)-1H-pyrazol-5-yl)-3-(naphthalen-1-yl)urea::CHEMBL1270956
SMILES: CC(C)(C)c1cc(NC(=O)Nc2cccc3ccccc23)n(n1)-c1cccc(CC(=O)N2CCOCC2)c1
InChI Key: InChIKey=DKHBZRQIUXSDJX-UHFFFAOYSA-N
Data: 1 IC50
Activity Spreadsheet -- Enzyme Inhibition Constant Data from BindingDB
Found 1 hit for monomerid = 50328762
Trg + Lig
Ki
nM
ΔG°
kcal/mole
IC50
nM
Kd
nM
EC50/IC50
nM
koff
s-1
kon
M-1s-1
pHTemp
°C
Mitogen-activated protein kinase 14
(Homo sapiens (Human))
BDBM50328762
(1-(3-tert-butyl-1-(3-(2-morpholino-2-oxoethyl)phen...)
Show SMILES CC(C)(C)c1cc(NC(=O)Nc2cccc3ccccc23)n(n1)-c1cccc(CC(=O)N2CCOCC2)c1
Show InChI InChI=1S/C30H33N5O3/c1-30(2,3)26-20-27(32-29(37)31-25-13-7-10-22-9-4-5-12-24(22)25)35(33-26)23-11-6-8-21(18-23)19-28(36)34-14-16-38-17-15-34/h4-13,18,20H,14-17,19H2,1-3H3,(H2,31,32,37)
NCI pathway
Reactome pathway
n/an/a 48n/an/an/an/an/an/a
Deciphera Pharmaceuticals LLC
Curated by ChEMBL
Assay Description
Inhibition of p38alpha by fluoroprobe binding assay
Bioorg Med Chem Lett 20: 5793-8 (2010)
Article DOI: 10.1016/j.bmcl.2010.07.134
BindingDB Entry DOI: 10.7270/Q2XD11WK