BDBM50328804 CHEMBL1269951::rac-1,2,5-trimethyl-4-(naphthalen-1-ylethynyl)piperidin-4-yl acetate
SMILES: CC1CC(OC(C)=O)(C#Cc2cccc3ccccc23)C(C)CN1C
InChI Key: InChIKey=RENBHJFCFJUFID-UHFFFAOYSA-N
Data: 2 IC50
Activity Spreadsheet -- Enzyme Inhibition Constant Data from BindingDB
Found 2 hits for monomerid = 50328804
Trg + Lig
Ki
nM
ΔG°
kcal/mole
IC50
nM
Kd
nM
EC50/IC50
nM
koff
s-1
kon
M-1s-1
pHTemp
°C
Histamine H3 receptor
(Homo sapiens (Human))
BDBM50328804
(CHEMBL1269951 | rac-1,2,5-trimethyl-4-(naphthalen-...)
Show SMILES CC1CC(OC(C)=O)(C#Cc2cccc3ccccc23)C(C)CN1C
Show InChI InChI=1S/C22H25NO2/c1-16-15-23(4)17(2)14-22(16,25-18(3)24)13-12-20-10-7-9-19-8-5-6-11-21(19)20/h5-11,16-17H,14-15H2,1-4H3
Reactome pathway
n/an/a 5.51E+3n/an/an/an/an/an/a
Athersys Inc.
Curated by ChEMBL
Assay Description
Antagonist activity against human histamine H3 receptor expressed in human HT1080 cells assessed as inhibition of (R)-alpha-methylhistamine-induced i...
Bioorg Med Chem Lett 20: 6246-9 (2010)
Article DOI: 10.1016/j.bmcl.2010.08.099
BindingDB Entry DOI: 10.7270/Q2DF6RGG
Histamine H3 receptor
(Mus musculus)
BDBM50328804
(CHEMBL1269951 | rac-1,2,5-trimethyl-4-(naphthalen-...)
Show SMILES CC1CC(OC(C)=O)(C#Cc2cccc3ccccc23)C(C)CN1C
Show InChI InChI=1S/C22H25NO2/c1-16-15-23(4)17(2)14-22(16,25-18(3)24)13-12-20-10-7-9-19-8-5-6-11-21(19)20/h5-11,16-17H,14-15H2,1-4H3
Reactome pathway
n/an/a>1.00E+4n/an/an/an/an/an/a
Athersys Inc.
Curated by ChEMBL
Assay Description
Antagonist activity against mouse histamine H3 receptor expressed in human HT1080 cells assessed as inhibition of (R)-alpha-methylhistamine-induced i...
Bioorg Med Chem Lett 20: 6246-9 (2010)
Article DOI: 10.1016/j.bmcl.2010.08.099
BindingDB Entry DOI: 10.7270/Q2DF6RGG