null
SMILES: CCC(CC)NC(=O)CCc1cc(nc(n1)C#N)-c1cccc(c1)C(F)(F)F
InChI Key: InChIKey=WSXMUOJNQNRRSA-UHFFFAOYSA-N
Activity Spreadsheet -- Enzyme Inhibition Constant Data from BindingDB
Found 2 hits for monomerid = 50328883
Trg + Lig
Ki
nM
ΔG°
kcal/mole
IC50
nM
Kd
nM
EC50/IC50
nM
koff
s-1
kon
M-1s-1
pHTemp
°C
Cathepsin K
(Homo sapiens (Human))
BDBM50328883
(3-(2-cyano-6-(3-(trifluoromethyl)phenyl)pyrimidin-...)
Show SMILES CCC(CC)NC(=O)CCc1cc(nc(n1)C#N)-c1cccc(c1)C(F)(F)F
Show InChI InChI=1S/C20H21F3N4O/c1-3-15(4-2)26-19(28)9-8-16-11-17(27-18(12-24)25-16)13-6-5-7-14(10-13)20(21,22)23/h5-7,10-11,15H,3-4,8-9H2,1-2H3,(H,26,28)
Reactome pathway
n/an/a 389n/an/an/an/an/an/a
Merck Research Laboratories
Curated by ChEMBL
Assay Description
Inhibition of human recombinant cathepsin K using Z-Phe-Arg-MCA substrate by fluorimetric assay
Bioorg Med Chem Lett 20: 6237-41 (2010)
Article DOI: 10.1016/j.bmcl.2010.08.101
BindingDB Entry DOI: 10.7270/Q2RR1ZFT
3D
3D Structure (docked)
Potassium voltage-gated channel subfamily H member 2
(Homo sapiens (Human))
BDBM50328883
(3-(2-cyano-6-(3-(trifluoromethyl)phenyl)pyrimidin-...)
Show SMILES CCC(CC)NC(=O)CCc1cc(nc(n1)C#N)-c1cccc(c1)C(F)(F)F
Show InChI InChI=1S/C20H21F3N4O/c1-3-15(4-2)26-19(28)9-8-16-11-17(27-18(12-24)25-16)13-6-5-7-14(10-13)20(21,22)23/h5-7,10-11,15H,3-4,8-9H2,1-2H3,(H,26,28)
Reactome pathway
3.16E+3n/an/an/an/an/an/an/an/a
Merck Research Laboratories
Curated by ChEMBL
Assay Description
Displacement of [3H] dofetilide from human ERG channel expressed in HEK293 cells
Bioorg Med Chem Lett 20: 6237-41 (2010)
Article DOI: 10.1016/j.bmcl.2010.08.101
BindingDB Entry DOI: 10.7270/Q2RR1ZFT