BDBM50328885 4-(3-(2,2,2-trifluoroethylamino)propyl)-6-(3-(trifluoromethyl)phenyl)pyrimidine-2-carbonitrile::CHEMBL1269847
SMILES: FC(F)(F)CNCCCc1cc(nc(n1)C#N)-c1cccc(c1)C(F)(F)F
InChI Key: InChIKey=ZJFWVNHALIHVNI-UHFFFAOYSA-N
Data: 1 KI  1 IC50
Activity Spreadsheet -- Enzyme Inhibition Constant Data from BindingDB
Found 2 hits for monomerid = 50328885
Trg + Lig
Ki
nM
ΔG°
kcal/mole
IC50
nM
Kd
nM
EC50/IC50
nM
koff
s-1
kon
M-1s-1
pHTemp
°C
Potassium voltage-gated channel subfamily H member 2
(Homo sapiens (Human))
BDBM50328885
(4-(3-(2,2,2-trifluoroethylamino)propyl)-6-(3-(trif...)
Show SMILES FC(F)(F)CNCCCc1cc(nc(n1)C#N)-c1cccc(c1)C(F)(F)F
Show InChI InChI=1S/C17H14F6N4/c18-16(19,20)10-25-6-2-5-13-8-14(27-15(9-24)26-13)11-3-1-4-12(7-11)17(21,22)23/h1,3-4,7-8,25H,2,5-6,10H2
Reactome pathway
500n/an/an/an/an/an/an/an/a
Merck Research Laboratories
Curated by ChEMBL
Assay Description
Displacement of [3H] dofetilide from human ERG channel expressed in HEK293 cells
Bioorg Med Chem Lett 20: 6237-41 (2010)
Article DOI: 10.1016/j.bmcl.2010.08.101
BindingDB Entry DOI: 10.7270/Q2RR1ZFT
Cathepsin K
(Homo sapiens (Human))
BDBM50328885
(4-(3-(2,2,2-trifluoroethylamino)propyl)-6-(3-(trif...)
Show SMILES FC(F)(F)CNCCCc1cc(nc(n1)C#N)-c1cccc(c1)C(F)(F)F
Show InChI InChI=1S/C17H14F6N4/c18-16(19,20)10-25-6-2-5-13-8-14(27-15(9-24)26-13)11-3-1-4-12(7-11)17(21,22)23/h1,3-4,7-8,25H,2,5-6,10H2
Reactome pathway
n/an/a 30n/an/an/an/an/an/a
Merck Research Laboratories
Curated by ChEMBL
Assay Description
Inhibition of human recombinant cathepsin K using Z-Phe-Arg-MCA substrate by fluorimetric assay
Bioorg Med Chem Lett 20: 6237-41 (2010)
Article DOI: 10.1016/j.bmcl.2010.08.101
BindingDB Entry DOI: 10.7270/Q2RR1ZFT
3D
3D Structure (docked)