BDBM50328895 1-(3-(2-cyano-6-(3-(trifluoromethyl)phenyl)pyrimidin-4-yl)propylamino)cyclopropanecarboxamide::CHEMBL1270366
SMILES: NC(=O)C1(CC1)NCCCc1cc(nc(n1)C#N)-c1cccc(c1)C(F)(F)F
InChI Key: InChIKey=PJWDCICTRLASSV-UHFFFAOYSA-N
Data: 1 KI  1 IC50
Activity Spreadsheet -- Enzyme Inhibition Constant Data from BindingDB
Found 2 hits for monomerid = 50328895
Trg + Lig
Ki
nM
ΔG°
kcal/mole
IC50
nM
Kd
nM
EC50/IC50
nM
koff
s-1
kon
M-1s-1
pHTemp
°C
Potassium voltage-gated channel subfamily H member 2
(Homo sapiens (Human))
BDBM50328895
(1-(3-(2-cyano-6-(3-(trifluoromethyl)phenyl)pyrimid...)
Show SMILES NC(=O)C1(CC1)NCCCc1cc(nc(n1)C#N)-c1cccc(c1)C(F)(F)F
Show InChI InChI=1S/C19H18F3N5O/c20-19(21,22)13-4-1-3-12(9-13)15-10-14(26-16(11-23)27-15)5-2-8-25-18(6-7-18)17(24)28/h1,3-4,9-10,25H,2,5-8H2,(H2,24,28)
Reactome pathway
1.58E+3n/an/an/an/an/an/an/an/a
Merck Research Laboratories
Curated by ChEMBL
Assay Description
Displacement of [3H] dofetilide from human ERG channel expressed in HEK293 cells
Bioorg Med Chem Lett 20: 6237-41 (2010)
Article DOI: 10.1016/j.bmcl.2010.08.101
BindingDB Entry DOI: 10.7270/Q2RR1ZFT
Cathepsin K
(Homo sapiens (Human))
BDBM50328895
(1-(3-(2-cyano-6-(3-(trifluoromethyl)phenyl)pyrimid...)
Show SMILES NC(=O)C1(CC1)NCCCc1cc(nc(n1)C#N)-c1cccc(c1)C(F)(F)F
Show InChI InChI=1S/C19H18F3N5O/c20-19(21,22)13-4-1-3-12(9-13)15-10-14(26-16(11-23)27-15)5-2-8-25-18(6-7-18)17(24)28/h1,3-4,9-10,25H,2,5-8H2,(H2,24,28)
Reactome pathway
n/an/a 12n/an/an/an/an/an/a
Merck Research Laboratories
Curated by ChEMBL
Assay Description
Inhibition of human recombinant cathepsin K using Z-Phe-Arg-MCA substrate by fluorimetric assay
Bioorg Med Chem Lett 20: 6237-41 (2010)
Article DOI: 10.1016/j.bmcl.2010.08.101
BindingDB Entry DOI: 10.7270/Q2RR1ZFT