BDBM50328898 (S)-4-(3-(2-cyano-6-(3-(trifluoromethyl)phenyl)pyrimidin-4-yl)propyl)morpholine-3-carboxamide::CHEMBL1270462
SMILES: NC(=O)[C@@H]1COCCN1CCCc1cc(nc(n1)C#N)-c1cccc(c1)C(F)(F)F
InChI Key: InChIKey=CSSISWGEWWLJQI-KRWDZBQOSA-N
Data: 1 KI  1 IC50
Activity Spreadsheet -- Enzyme Inhibition Constant Data from BindingDB
Found 2 hits for monomerid = 50328898
Trg + Lig
Ki
nM
ΔG°
kcal/mole
IC50
nM
Kd
nM
EC50/IC50
nM
koff
s-1
kon
M-1s-1
pHTemp
°C
Potassium voltage-gated channel subfamily H member 2
(Homo sapiens (Human))
BDBM50328898
((S)-4-(3-(2-cyano-6-(3-(trifluoromethyl)phenyl)pyr...)
Show SMILES NC(=O)[C@@H]1COCCN1CCCc1cc(nc(n1)C#N)-c1cccc(c1)C(F)(F)F |r|
Show InChI InChI=1S/C20H20F3N5O2/c21-20(22,23)14-4-1-3-13(9-14)16-10-15(26-18(11-24)27-16)5-2-6-28-7-8-30-12-17(28)19(25)29/h1,3-4,9-10,17H,2,5-8,12H2,(H2,25,29)/t17-/m0/s1
Reactome pathway
>1.00E+4n/an/an/an/an/an/an/an/a
Merck Research Laboratories
Curated by ChEMBL
Assay Description
Displacement of [3H] dofetilide from human ERG channel expressed in HEK293 cells
Bioorg Med Chem Lett 20: 6237-41 (2010)
Article DOI: 10.1016/j.bmcl.2010.08.101
BindingDB Entry DOI: 10.7270/Q2RR1ZFT
Cathepsin K
(Homo sapiens (Human))
BDBM50328898
((S)-4-(3-(2-cyano-6-(3-(trifluoromethyl)phenyl)pyr...)
Show SMILES NC(=O)[C@@H]1COCCN1CCCc1cc(nc(n1)C#N)-c1cccc(c1)C(F)(F)F |r|
Show InChI InChI=1S/C20H20F3N5O2/c21-20(22,23)14-4-1-3-13(9-14)16-10-15(26-18(11-24)27-16)5-2-6-28-7-8-30-12-17(28)19(25)29/h1,3-4,9-10,17H,2,5-8,12H2,(H2,25,29)/t17-/m0/s1
Reactome pathway
n/an/a 13n/an/an/an/an/an/a
Merck Research Laboratories
Curated by ChEMBL
Assay Description
Inhibition of human recombinant cathepsin K using Z-Phe-Arg-MCA substrate by fluorimetric assay
Bioorg Med Chem Lett 20: 6237-41 (2010)
Article DOI: 10.1016/j.bmcl.2010.08.101
BindingDB Entry DOI: 10.7270/Q2RR1ZFT