BDBM50328905 (3R,4S)-N-(2-chloro-5-(2-methoxyethyl)benzyl)-N-cyclopropyl-4-(6-(2-(2,6-dichloro-4-methylphenoxy)ethoxy)pyridin-3-yl)piperidine-3-carboxamide::CHEMBL1269743
SMILES: COCCc1ccc(Cl)c(CN(C2CC2)C(=O)[C@H]2CNCC[C@@H]2c2ccc(OCCOc3c(Cl)cc(C)cc3Cl)nc2)c1
InChI Key: InChIKey=PGSRKJVMAOWDEC-SXOMAYOGSA-N
Data: 2 IC50
Activity Spreadsheet -- Enzyme Inhibition Constant Data from BindingDB
Found 2 hits for monomerid = 50328905
Trg + Lig
Ki
nM
ΔG°
kcal/mole
IC50
nM
Kd
nM
EC50/IC50
nM
koff
s-1
kon
M-1s-1
pHTemp
°C
Renin
(Homo sapiens (Human))
BDBM50328905
((3R,4S)-N-(2-chloro-5-(2-methoxyethyl)benzyl)-N-cy...)
Show SMILES COCCc1ccc(Cl)c(CN(C2CC2)C(=O)[C@H]2CNCC[C@@H]2c2ccc(OCCOc3c(Cl)cc(C)cc3Cl)nc2)c1 |r|
Show InChI InChI=1S/C33H38Cl3N3O4/c1-21-15-29(35)32(30(36)16-21)43-14-13-42-31-8-4-23(18-38-31)26-9-11-37-19-27(26)33(40)39(25-5-6-25)20-24-17-22(10-12-41-2)3-7-28(24)34/h3-4,7-8,15-18,25-27,37H,5-6,9-14,19-20H2,1-2H3/t26-,27+/m1/s1
Reactome pathway
n/an/a 1.40n/an/an/an/an/an/a
Actelion Pharmaceuticals Ltd
Curated by ChEMBL
Assay Description
Inhibition of renin in plasma
Bioorg Med Chem Lett 20: 6291-6 (2010)
Article DOI: 10.1016/j.bmcl.2010.08.087
BindingDB Entry DOI: 10.7270/Q2H70G2C
3D
3D Structure (docked)
Renin
(Homo sapiens (Human))
BDBM50328905
((3R,4S)-N-(2-chloro-5-(2-methoxyethyl)benzyl)-N-cy...)
Show SMILES COCCc1ccc(Cl)c(CN(C2CC2)C(=O)[C@H]2CNCC[C@@H]2c2ccc(OCCOc3c(Cl)cc(C)cc3Cl)nc2)c1 |r|
Show InChI InChI=1S/C33H38Cl3N3O4/c1-21-15-29(35)32(30(36)16-21)43-14-13-42-31-8-4-23(18-38-31)26-9-11-37-19-27(26)33(40)39(25-5-6-25)20-24-17-22(10-12-41-2)3-7-28(24)34/h3-4,7-8,15-18,25-27,37H,5-6,9-14,19-20H2,1-2H3/t26-,27+/m1/s1
Reactome pathway
n/an/a 0.0700n/an/an/an/an/an/a
Actelion Pharmaceuticals Ltd
Curated by ChEMBL
Assay Description
Inhibition of renin in buffer
Bioorg Med Chem Lett 20: 6291-6 (2010)
Article DOI: 10.1016/j.bmcl.2010.08.087
BindingDB Entry DOI: 10.7270/Q2H70G2C
3D
3D Structure (docked)