BDBM50328965 CHEMBL1269770::N,N'-[(Methylimino)diheptane-7,1-diyl]bis[5-(4-chlorophenyl)-1-(2,4-dichlorophenyl)-4-methyl-1H-pyrazole-3-carboxamide]
SMILES: CN(CCCCCCCNC(=O)c1nn(c(c1C)-c1ccc(Cl)cc1)-c1ccc(Cl)cc1Cl)CCCCCCCNC(=O)c1nn(c(c1C)-c1ccc(Cl)cc1)-c1ccc(Cl)cc1Cl
InChI Key: InChIKey=MVOOASXFNPWAHT-UHFFFAOYSA-N
Data: 3 KI  2 EC50
Activity Spreadsheet -- Enzyme Inhibition Constant Data from BindingDB
Found 5 hits for monomerid = 50328965
Trg + Lig
Ki
nM
ΔG°
kcal/mole
IC50
nM
Kd
nM
EC50/IC50
nM
koff
s-1
kon
M-1s-1
pHTemp
°C
Cannabinoid receptor 1
(Homo sapiens (Human))
BDBM50328965
(CHEMBL1269770 | N,N'-[(Methylimino)diheptane-7,1-d...)
Show SMILES CN(CCCCCCCNC(=O)c1nn(c(c1C)-c1ccc(Cl)cc1)-c1ccc(Cl)cc1Cl)CCCCCCCNC(=O)c1nn(c(c1C)-c1ccc(Cl)cc1)-c1ccc(Cl)cc1Cl
Show InChI InChI=1S/C49H53Cl6N7O2/c1-32-44(58-61(42-24-22-38(52)30-40(42)54)46(32)34-14-18-36(50)19-15-34)48(63)56-26-10-6-4-8-12-28-60(3)29-13-9-5-7-11-27-57-49(64)45-33(2)47(35-16-20-37(51)21-17-35)62(59-45)43-25-23-39(53)31-41(43)55/h14-25,30-31H,4-13,26-29H2,1-3H3,(H,56,63)(H,57,64)
NCI pathway
Reactome pathway
17.3n/an/an/an/an/an/an/an/a
Research Triangle Institute
Curated by ChEMBL
Assay Description
Displacement of [3H]CP55940 from human CB1 receptor expressed in HEK293 cells
J Med Chem 53: 7048-60 (2010)
Article DOI: 10.1021/jm1006676
BindingDB Entry DOI: 10.7270/Q27P8ZMC
Cannabinoid receptor 1
(Homo sapiens (Human))
BDBM50328965
(CHEMBL1269770 | N,N'-[(Methylimino)diheptane-7,1-d...)
Show SMILES CN(CCCCCCCNC(=O)c1nn(c(c1C)-c1ccc(Cl)cc1)-c1ccc(Cl)cc1Cl)CCCCCCCNC(=O)c1nn(c(c1C)-c1ccc(Cl)cc1)-c1ccc(Cl)cc1Cl
Show InChI InChI=1S/C49H53Cl6N7O2/c1-32-44(58-61(42-24-22-38(52)30-40(42)54)46(32)34-14-18-36(50)19-15-34)48(63)56-26-10-6-4-8-12-28-60(3)29-13-9-5-7-11-27-57-49(64)45-33(2)47(35-16-20-37(51)21-17-35)62(59-45)43-25-23-39(53)31-41(43)55/h14-25,30-31H,4-13,26-29H2,1-3H3,(H,56,63)(H,57,64)
NCI pathway
Reactome pathway
27.5n/an/an/an/an/an/an/an/a
Research Triangle Institute
Curated by ChEMBL
Assay Description
Displacement of [3H]SR141716 from human CB1 receptor expressed in HEK293 cells
J Med Chem 53: 7048-60 (2010)
Article DOI: 10.1021/jm1006676
BindingDB Entry DOI: 10.7270/Q27P8ZMC
Cannabinoid receptor 2
(Homo sapiens (Human))
BDBM50328965
(CHEMBL1269770 | N,N'-[(Methylimino)diheptane-7,1-d...)
Show SMILES CN(CCCCCCCNC(=O)c1nn(c(c1C)-c1ccc(Cl)cc1)-c1ccc(Cl)cc1Cl)CCCCCCCNC(=O)c1nn(c(c1C)-c1ccc(Cl)cc1)-c1ccc(Cl)cc1Cl
Show InChI InChI=1S/C49H53Cl6N7O2/c1-32-44(58-61(42-24-22-38(52)30-40(42)54)46(32)34-14-18-36(50)19-15-34)48(63)56-26-10-6-4-8-12-28-60(3)29-13-9-5-7-11-27-57-49(64)45-33(2)47(35-16-20-37(51)21-17-35)62(59-45)43-25-23-39(53)31-41(43)55/h14-25,30-31H,4-13,26-29H2,1-3H3,(H,56,63)(H,57,64)
Reactome pathway
683n/an/an/an/an/an/an/an/a
Research Triangle Institute
Curated by ChEMBL
Assay Description
Displacement of [3H]CP55940 from human CB2 receptor expressed in CHOK1 cells
J Med Chem 53: 7048-60 (2010)
Article DOI: 10.1021/jm1006676
BindingDB Entry DOI: 10.7270/Q27P8ZMC
Cannabinoid receptor 1
(Homo sapiens (Human))
BDBM50328965
(CHEMBL1269770 | N,N'-[(Methylimino)diheptane-7,1-d...)
Show SMILES CN(CCCCCCCNC(=O)c1nn(c(c1C)-c1ccc(Cl)cc1)-c1ccc(Cl)cc1Cl)CCCCCCCNC(=O)c1nn(c(c1C)-c1ccc(Cl)cc1)-c1ccc(Cl)cc1Cl
Show InChI InChI=1S/C49H53Cl6N7O2/c1-32-44(58-61(42-24-22-38(52)30-40(42)54)46(32)34-14-18-36(50)19-15-34)48(63)56-26-10-6-4-8-12-28-60(3)29-13-9-5-7-11-27-57-49(64)45-33(2)47(35-16-20-37(51)21-17-35)62(59-45)43-25-23-39(53)31-41(43)55/h14-25,30-31H,4-13,26-29H2,1-3H3,(H,56,63)(H,57,64)
NCI pathway
Reactome pathway
n/an/an/an/a 2.24E+3n/an/an/an/a
Research Triangle Institute
Curated by ChEMBL
Assay Description
Antagonist activity at human brain CB1 receptor assessed as inhibition for [35S]GTPgammaS binding
J Med Chem 53: 7048-60 (2010)
Article DOI: 10.1021/jm1006676
BindingDB Entry DOI: 10.7270/Q27P8ZMC
Cannabinoid receptor 1
(Rattus norvegicus (rat))
BDBM50328965
(CHEMBL1269770 | N,N'-[(Methylimino)diheptane-7,1-d...)
Show SMILES CN(CCCCCCCNC(=O)c1nn(c(c1C)-c1ccc(Cl)cc1)-c1ccc(Cl)cc1Cl)CCCCCCCNC(=O)c1nn(c(c1C)-c1ccc(Cl)cc1)-c1ccc(Cl)cc1Cl
Show InChI InChI=1S/C49H53Cl6N7O2/c1-32-44(58-61(42-24-22-38(52)30-40(42)54)46(32)34-14-18-36(50)19-15-34)48(63)56-26-10-6-4-8-12-28-60(3)29-13-9-5-7-11-27-57-49(64)45-33(2)47(35-16-20-37(51)21-17-35)62(59-45)43-25-23-39(53)31-41(43)55/h14-25,30-31H,4-13,26-29H2,1-3H3,(H,56,63)(H,57,64)
Reactome pathway
n/an/an/an/a 1.46E+3n/an/an/an/a
Research Triangle Institute
Curated by ChEMBL
Assay Description
Antagonist activity at rat brain CB1 receptor assessed as inhibition of [35S]GTPgammaS binding
J Med Chem 53: 7048-60 (2010)
Article DOI: 10.1021/jm1006676
BindingDB Entry DOI: 10.7270/Q27P8ZMC